Package Base Details: vbam-svn

Git Clone URL: https://aur-dev.archlinux.org/vbam-svn.git (read-only)
Submitter: alucryd
Maintainer: None
Last Packager: alucryd
Votes: 97
Popularity: 0.027845
First Submitted: 2014-08-21 09:48
Last Updated: 2015-06-08 09:11

Latest Comments

« First ‹ Previous ... 5 6 7 8 9 10 11 12 13 14 Next › Last »

favadi commented on 2011-12-08 02:59

@nghiavd: What's your hardware specification and your /etc/makepkg.conf?

Anonymous comment on 2011-12-07 15:36

I still cannot build this package. Here's the error:

[ 74%] Building CXX object CMakeFiles/vbamcore.dir/src/filters/hq/c/hq_implementation.cpp.o
{standard input}: Assembler messages:
{standard input}:36781: Warning: end of file not at end of a line; newline inserted
{standard input}: Error: open CFI at the end of file; missing .cfi_endproc directive
c++: internal compiler error: Killed (program cc1plus)
Please submit a full bug report,
with preprocessed source if appropriate.
See <https://bugs.archlinux.org/> for instructions.
make[2]: *** [CMakeFiles/vbamcore.dir/src/filters/hq/c/hq_implementation.cpp.o] Error 4
make[1]: *** [CMakeFiles/vbamcore.dir/all] Error 2
make: *** [all] Error 2

favadi commented on 2011-12-05 02:35

@bzt: fixed!

bzt commented on 2011-12-04 08:10

PKGBUILD needs adjustment. Just remove the line below and it builds again.

cp -r dependencies/fex $_svnmod-build/

Anonymous comment on 2011-11-30 06:52

Don't think so. It's handled bigger stuff than this without a problem, only this it chokes on.
Will give it one more try when I get back from work to find out though.

favadi commented on 2011-11-30 02:45

@TheStarLion:
I've just rebuild this package and everything seems go well. (Both 32 and 64)
Maybe your computer is a bit weak?

Anonymous comment on 2011-11-29 20:31

Yep. Compiling hangs when trying to compile the hq filter. Can't get the exact filename, since the entire system also hangs because of it. Happens every time when building via yaourt and makepkg - on x86_64, at least.

favadi commented on 2011-11-20 12:02

Anyone has problem when building this package?
I still don't know why save states hot keys not working.

DullOnion commented on 2011-10-14 20:39

I'm having an issue with using the hot keys to save states. Seems like an xorg update might have broken it.

https://bbs.archlinux.org/viewtopic.php?id=128329

Anonymous comment on 2011-09-29 00:48

Can you please update the dependency Zephyr? If not, can you please orphan the package to allow someone else to add it.