Package Base Details: vbam-svn

Git Clone URL: https://aur-dev.archlinux.org/vbam-svn.git (read-only)
Submitter: alucryd
Maintainer: None
Last Packager: alucryd
Votes: 97
Popularity: 0.027845
First Submitted: 2014-08-21 09:48
Last Updated: 2015-06-08 09:11

Latest Comments

« First ‹ Previous ... 4 5 6 7 8 9 10 11 12 13 14 Next › Last »

Anonymous comment on 2012-02-12 00:17

Hello, I needed to install sfml package from community to compile the vba-m, but it isn't on the depends or makedepends PKGBUILD's grid. Is this right? sorry my english

reki commented on 2012-02-06 07:59

Add -DCMAKE_CXX_FLAGS="-fpermissive" to the cmake line and it compile.

ShadowKyogre commented on 2012-02-06 03:49

Is anyone getting an error related to zlib when they compile? I get this when I try to recompile it:

/tmp/yaourt-tmp-shadowkyogre/aur-vba-m-gtk-svn/src/vbam-build/fex/fex/Data_Reader.cpp: In member function ‘virtual const char* Gzip_File_Reader::read_v(void*, int)’:
/tmp/yaourt-tmp-shadowkyogre/aur-vba-m-gtk-svn/src/vbam-build/fex/fex/Data_Reader.cpp:735:35: error: invalid conversion from ‘void*’ to ‘gzFile’ [-fpermissive]
/usr/include/zlib.h:1290:21: error: initializing argument 1 of ‘int gzread(gzFile, voidp, unsigned int)’ [-fpermissive]
/tmp/yaourt-tmp-shadowkyogre/aur-vba-m-gtk-svn/src/vbam-build/fex/fex/Data_Reader.cpp:739:35: error: invalid conversion from ‘void*’ to ‘gzFile’ [-fpermissive]
/tmp/yaourt-tmp-shadowkyogre/aur-vba-m-gtk-svn/src/vbam-build/fex/fex/Data_Reader.cpp:718:21: error: initializing argument 1 of ‘const char* convert_gz_error(gzFile)’ [-fpermissive]
/tmp/yaourt-tmp-shadowkyogre/aur-vba-m-gtk-svn/src/vbam-build/fex/fex/Data_Reader.cpp: In member function ‘virtual const char* Gzip_File_Reader::seek_v(int)’:
/tmp/yaourt-tmp-shadowkyogre/aur-vba-m-gtk-svn/src/vbam-build/fex/fex/Data_Reader.cpp:749:34: error: invalid conversion from ‘void*’ to ‘gzFile’ [-fpermissive]
/usr/include/zlib.h:1698:28: error: initializing argument 1 of ‘off_t gzseek(gzFile, off_t, int)’ [-fpermissive]
/tmp/yaourt-tmp-shadowkyogre/aur-vba-m-gtk-svn/src/vbam-build/fex/fex/Data_Reader.cpp:750:34: error: invalid conversion from ‘void*’ to ‘gzFile’ [-fpermissive]
/tmp/yaourt-tmp-shadowkyogre/aur-vba-m-gtk-svn/src/vbam-build/fex/fex/Data_Reader.cpp:718:21: error: initializing argument 1 of ‘const char* convert_gz_error(gzFile)’ [-fpermissive]
/tmp/yaourt-tmp-shadowkyogre/aur-vba-m-gtk-svn/src/vbam-build/fex/fex/Data_Reader.cpp: In member function ‘void Gzip_File_Reader::close()’:
/tmp/yaourt-tmp-shadowkyogre/aur-vba-m-gtk-svn/src/vbam-build/fex/fex/Data_Reader.cpp:759:23: error: invalid conversion from ‘void*’ to ‘gzFile’ [-fpermissive]
/usr/include/zlib.h:1488:24: error: initializing argument 1 of ‘int gzclose(gzFile)’ [-fpermissive]
make[2]: *** [CMakeFiles/fex.dir/fex/fex/Data_Reader.cpp.o] Error 1
make[2]: *** Waiting for unfinished jobs....
make[1]: *** [CMakeFiles/fex.dir/all] Error 2
make: *** [all] Error 2

Anonymous comment on 2012-01-07 14:51

@zodmaner Thanks for your answer!

I guess i will keep with the version I have, at least until i can upgrade my PC...

Anonymous comment on 2012-01-07 14:26

@diegoxter: Yeah, the compilation uses a huge amount of memory on my system too, and is quite slow. Despite that, it (eventually) compiles and work just fine.

I have 2GB of RAM, for that matter.

Anonymous comment on 2012-01-07 13:40

Does somebody else suffer from a huge memory consumption while compiling this? I cant compile it because it gets so heavy that starts eating even my swap.
I got 1gb of ram, and my system is updated...

bzt commented on 2011-12-09 14:08

Builds fine here with gcc-multilib 4.6.2-3.

favadi commented on 2011-12-09 11:16

I build it successfully.
Maybe the problem is with dependencies.
I'll investigate on the weekend.

Anonymous comment on 2011-12-08 23:22

[ 74%] Building CXX object CMakeFiles/vbamcore.dir/src/filters/hq/c/hq_implementation.cpp.o
{standard input}: Assembler messages:
{standard input}:36822: Warning: end of file not at end of a line; newline inserted
{standard input}:38001: Error: bad register name `%e'
{standard input}: Error: open CFI at the end of file; missing .cfi_endproc directive
c++: interner Compiler-Fehler: Getötet (Programm cc1plus)
Bitte senden Sie einen vollständigen Fehlerbericht auf Englisch ein;
bearbeiten Sie die Quellen zunächst mit einem Präprozessor, wenn es
dienlich ist.
Fehler in der deutschen Übersetzung sind an translation-team-de@lists.sourceforge.net zu melden.

Gehen Sie gemäß den Hinweisen in <https://bugs.archlinux.org/> vor.
make[2]: *** [CMakeFiles/vbamcore.dir/src/filters/hq/c/hq_implementation.cpp.o] Fehler 4
make[1]: *** [CMakeFiles/vbamcore.dir/all] Fehler 2
make: *** [all] Fehler 2
==> FEHLER: Ein Fehler geschah in build().
Breche ab ...
==> ERROR: Makepkg was unable to build vba-m-gtk-svn.
==> Restart building vba-m-gtk-svn ? [y/N]

favadi commented on 2011-12-08 02:59

@nghiavd: Can you show me your hardware specification and your /etc/makepkg.conf?