Package Base Details: vbam-svn

Git Clone URL: https://aur-dev.archlinux.org/vbam-svn.git (read-only)
Submitter: alucryd
Maintainer: None
Last Packager: alucryd
Votes: 97
Popularity: 0.027845
First Submitted: 2014-08-21 09:48
Last Updated: 2015-06-08 09:11

Latest Comments

1 2 3 4 5 6 ... Next › Last »

kodur commented on 2016-10-20 16:58

/tmp/yaourt-tmp-kodur/aur-vbam-gtk-svn/src/vbam/src/common/ffmpeg.cpp: In member function ‘MediaRet MediaRecorder::finish_setup(const char*)’:
/tmp/yaourt-tmp-kodur/aur-vbam-gtk-svn/src/vbam/src/common/ffmpeg.cpp:298:36: warning: ignoring return value of ‘int avformat_write_header(AVFormatContext*, AVDictionary**)’, declared with attribute warn_unused_result [-Wunused-result]
avformat_write_header(oc, NULL);
^
make[2]: *** [CMakeFiles/vbamcore.dir/build.make:231: CMakeFiles/vbamcore.dir/src/common/ffmpeg.cpp.o] Error 1
make[1]: *** [CMakeFiles/Makefile2:68: CMakeFiles/vbamcore.dir/all] Error 2
make: *** [Makefile:150: all] Error 2
==> ERROR: A failure occurred in build().
Aborting...
==> ERROR: Makepkg was unable to build vbam-svn.

Quardah commented on 2016-03-22 01:13

CMakeFiles/vbamcore.dir/build.make:230: recipe for target 'CMakeFiles/vbamcore.dir/src/common/ffmpeg.cpp.o' failed
make[2]: *** [CMakeFiles/vbamcore.dir/src/common/ffmpeg.cpp.o] Error 1
CMakeFiles/Makefile2:67: recipe for target 'CMakeFiles/vbamcore.dir/all' failed
make[1]: *** [CMakeFiles/vbamcore.dir/all] Error 2
Makefile:149: recipe for target 'all' failed
make: *** [all] Error 2
==> ERROR: A failure occurred in build().
Aborting...
==> ERROR: Makepkg was unable to build vbam-svn.

No clue what to do.

petterk commented on 2016-01-22 12:08

/tmp/yaourt-tmp-petterk/aur-vbam-gtk-svn/./PKGBUILD: line 77: cd: vbam/build: No such file or directory
==> ERROR: A failure occurred in package_vbam-gtk-svn().
Aborting...
==> ERROR: Makepkg was unable to build vbam-svn.

breul99 commented on 2015-05-30 02:44

Build currently fails,
[ 18%] Building CXX object CMakeFiles/vbamcore.dir/src/common/ConfigManager.cpp.o
In file included from /tmp/yaourt-tmp/aur-vbam-gtk-svn/src/vbam/src/common/../AutoBuild.h:22:0,
from /tmp/yaourt-tmp/aur-vbam-gtk-svn/src/vbam/src/common/ConfigManager.cpp:14:
/tmp/yaourt-tmp/aur-vbam-gtk-svn/src/vbam/src/common/../version.h:23:20: fatal error: svnrev.h: No such file or directory
compilation terminated.
CMakeFiles/vbamcore.dir/build.make:77: recipe for target 'CMakeFiles/vbamcore.dir/src/common/ConfigManager.cpp.o' failed
make[2]: *** [CMakeFiles/vbamcore.dir/src/common/ConfigManager.cpp.o] Error 1
CMakeFiles/Makefile2:96: recipe for target 'CMakeFiles/vbamcore.dir/all' failed
make[1]: *** [CMakeFiles/vbamcore.dir/all] Error 2
Makefile:136: recipe for target 'all' failed
make: *** [all] Error 2

alucryd commented on 2015-05-18 08:02

TBlue: Indeed, forgot to add sfml to the makedeps last time, thx. The build fails here though, most likely because of GCC 5, I'll be looking into it.

Tblue commented on 2015-05-14 15:05

It looks like makepkg does not recognize the values for "depends" in the package_...() functions when checking dependencies before the build. In my case it didn't recognize that I hadn't sfml installed, which caused the build to fail with a compiler error.

However, the built packages contain the correct dependencies; so this is only a build-time issue. Since the split package always builds all packages anyway (as far as I can see), a fix could be to copy those dependencies which are required at build time from the package-specific "depends" arrays to the global "makedepends" array.

alucryd commented on 2015-05-11 07:33

Thx, package updated. Also no more static linking of sfml and soil, vbam is now compatible with our sfml.

applebloom commented on 2015-05-09 16:11

vbam-ffmpeg2.patch is already applied in upstream.

Anonymous comment on 2015-03-23 01:48

Link/Joybus works great on Arch despite the 'Unable to find driver' warning! I tested link for Pokemon Emerald on two vbam-wx svn 1239 and joybus for Zelda Four Sword on vbam-wx svn 1239 and Dolphin-emu-git 4.0r5923. Both are working quite well. Pokemon Emerald falls to 40fps and have some sound stutter issue when using link, and Zelda Four Sword runs at full speed when using joybus! The result on Arch is way better than that on Windows. And the 'Unable to find driver' warning can just be ignored.

Now I am trying to revise patches to port vbam to SFML 2.x(origin:http://sourceforge.net/p/vbam/patches/55, it is obsolete for the current svn version). I think my patches are almost complete except for

return !client.IsValid() || !clock_client.IsValid() || is_disconnected;

in src/gba/GBASockClient.cpp. IsValid() is 1.6 only and it should be replaced but I cannot find a proper one to do that after reading SFML 2.x documentation...

Anonymous comment on 2015-03-23 01:48

Link/Joybus works great on Arch despite the 'Unable to find driver' warning! I tested link for Pokemon Emerald on two vbam-wx svn 1239 and joybus for Zelda Four Sword on vbam-wx svn 1239 and Dolphin-emu-git 4.0r5923. Both are working quite well. Pokemon Emerald falls to 40fps and have some sound stutter issue when using link, and Zelda Four Sword runs at full speed when using joybus! The result on Arch is way better than that on Windows. And the 'Unable to find driver' warning can just be ignored.

Now I am trying to revise patches to port vbam to SFML 2.x(origin:http://sourceforge.net/p/vbam/patches/55, it is obsolete for the current svn version). I think my patches are almost finished except for

return !client.IsValid() || !clock_client.IsValid() || is_disconnected;

in src/gba/GBASockClient.cpp. IsValid() is 1.6 only and it should be replaced but I cannot find a proper one to do that after reading SFML 2.x documentation...