Warning: file_exists(): open_basedir restriction in effect. File(/srv/http/vhosts/aur.archlinux.org/public/web/locale//en/LC_MESSAGES/aurweb.mo) is not within the allowed path(s): (/srv/http/vhosts/aur-dev.archlinux.org/:/etc/aurweb/) in /srv/http/vhosts/aur-dev.archlinux.org/public/web/lib/streams.php on line 90
AUR (en) - sqlitestudio

Package Base Details: sqlitestudio

Git Clone URL: https://aur-dev.archlinux.org/sqlitestudio.git (read-only)
Submitter: dracorp
Maintainer: dracorp
Last Packager: dracorp
Votes: 9
Popularity: 0.197315
First Submitted: 2012-11-22 08:28
Last Updated: 2016-11-04 19:43

Latest Comments

« First ‹ Previous 1 2 3 4 5 Next › Last »

popsch commented on 2016-01-16 21:46

why do you make it depend on sqlite2 instead of sqlite? It supports sqlite3 perfectly fine.

dracorp commented on 2015-10-10 15:31

Removed gcc-libs as already satisfied.

haawda commented on 2015-10-09 20:32

do not depend on gcc-libs-multilib, gcc-libs is the correct one for all repos. gcc-libs-multilib provides gcc-libs.

dracorp commented on 2015-10-09 19:56

@Romzetron: Thanks a lot, updated.

dracorp commented on 2015-10-08 07:42

@Romzetron I'll add temporary a patch, when I return home.

Romzetron commented on 2015-10-07 21:25

Done. http://bugs.sqlitestudio.pl/?id=2870

dracorp commented on 2015-10-07 20:52

@Romzetron: I think that you must inform about it the author.

Romzetron commented on 2015-10-07 02:48

I have Qt5.5 installed and ran into the same error when building the package. After a little research, I found that <QDataStream> needs to be included explicitly. The include was implied in previous version of Qt. I opened up the project in qtcreator, compiled, and found that the following files were missing "#include <QDataStream>". After patching up the source in the package, it built and installed successfully.


bhrgunatha commented on 2015-09-29 03:48

I have qt5-svg and qt5-tools installed, but I'm still getting a compilation error.

../../../SQLiteStudio3/coreSQLiteStudio/common/utils.cpp: In function ‘QByteArray hashToBytes(const QHash<QString, QVariant>&)’:
../../../SQLiteStudio3/coreSQLiteStudio/common/utils.cpp:321:23: error: variable ‘QDataStream stream’ has initializer but incomplete type
QDataStream stream(&bytes, QIODevice::WriteOnly);
../../../SQLiteStudio3/coreSQLiteStudio/common/utils.cpp: In function ‘QHash<QString, QVariant> bytesToHash(const QByteArray&)’:
../../../SQLiteStudio3/coreSQLiteStudio/common/utils.cpp:332:29: error: variable ‘QDataStream stream’ has initializer but incomplete type
QDataStream stream(bytes);
Makefile:2864: recipe for target 'utils.o' failed
make[1]: *** [utils.o] Error 1
make[1]: Leaving directory ...
Makefile:45: recipe for target 'sub-coreSQLiteStudio-make_first' failed
make: *** [sub-coreSQLiteStudio-make_first] Error 2

Looks like it's related to Qt... any ideas?
Am I missing another dependency?

dracorp commented on 2015-05-20 16:05

Yes, it is good idea. Thx awpe.