Package Base Details: mysql

Git Clone URL: https://aur-dev.archlinux.org/mysql.git (read-only)
Submitter: Barthalion
Maintainer: Muflone
Last Packager: Muflone
Votes: 44
Popularity: 1.427572
First Submitted: 2013-04-25 19:13
Last Updated: 2016-10-16 22:32

Latest Comments

« First ‹ Previous 1 2 3 4 5 6 7 Next › Last »

enteenteente commented on 2013-10-02 22:08

i do get:
"/aur-mysql/./PKGBUILD: line 29: patch: command not found"
probably only because of a missing build-dependency to patch.

sitquietly commented on 2013-09-11 21:58

Thanks for keeping mysql available on Arch! The current situation with mariadb is a mess. mariadb won't compile against boost-1.54, but mysql is working fine for me. Now I understand why Beyond Linux From Scratch calls for mysql-5.6.13 along with boost-1.54.

rustam commented on 2013-08-21 14:20

@landif: I've added a patch for this problem.

Anonymous comment on 2013-08-19 22:10

I keep getting this compilation error in all machine i have tried to build on:

[ 40%] Building CXX object storage/innobase/CMakeFiles/innobase.dir/row/row0log.cc.o
/root/packages/mysql/src/mysql-5.6.13/storage/innobase/row/row0log.cc: In function ‘dberr_t row_log_table_apply_ops(que_thr_t*, row_merge_dup_t*)’:
/root/packages/mysql/src/mysql-5.6.13/storage/innobase/row/row0log.cc:2367:11: error: ‘srv_buf_size’ was not declared in this scope
ofs, srv_buf_size);
^
/root/packages/mysql/src/mysql-5.6.13/storage/innobase/row/row0log.cc: In function ‘dberr_t row_log_apply_ops(trx_t*, dict_index_t*, row_merge_dup_t*)’:
/root/packages/mysql/src/mysql-5.6.13/storage/innobase/row/row0log.cc:3156:11: error: ‘srv_buf_size’ was not declared in this scope
ofs, srv_buf_size);
^
/root/packages/mysql/src/mysql-5.6.13/storage/innobase/row/row0log.cc: In function ‘dberr_t row_log_table_apply_ops(que_thr_t*, row_merge_dup_t*)’:
/root/packages/mysql/src/mysql-5.6.13/storage/innobase/row/row0log.cc:2310:39: warning: ignoring return value of ‘int ftruncate(int, __off64_t)’, declared with attribute warn_unused_result [-Wunused-result]
ftruncate(index->online_log->fd, 0);
^
/root/packages/mysql/src/mysql-5.6.13/storage/innobase/row/row0log.cc: In function ‘dberr_t row_log_apply_ops(trx_t*, dict_index_t*, row_merge_dup_t*)’:
/root/packages/mysql/src/mysql-5.6.13/storage/innobase/row/row0log.cc:3103:39: warning: ignoring return value of ‘int ftruncate(int, __off64_t)’, declared with attribute warn_unused_result [-Wunused-result]
ftruncate(index->online_log->fd, 0);
^
make[2]: *** [storage/innobase/CMakeFiles/innobase.dir/row/row0log.cc.o] Error 1
make[1]: *** [storage/innobase/CMakeFiles/innobase.dir/all] Error 2
make: *** [all] Error 2
==> ERROR: A failure occurred in build().
Aborting...

Anonymous comment on 2013-07-10 23:45

@rustam problem FIXED!

rustam commented on 2013-07-10 11:19

@vfbsilva: I've updated the package so it now cleans out the build directory before building, this should resolve the problem.

Anonymous comment on 2013-07-10 04:21

I cannot build this package
==> Making package: mysql 5.6.12-2 (Wed Jul 10 01:13:20 BRT 2013)
==> Checking runtime dependencies...
==> Checking buildtime dependencies...
==> Retrieving sources...
-> Found mysql-5.6.12.tar.gz
-> Found mysql-5.6.12.tar.gz.asc
-> Found mysqld-post.sh
-> Found mysqld-tmpfile.conf
-> Found mysqld.service
==> Validating source files with sha256sums...
mysql-5.6.12.tar.gz ... Passed
mysql-5.6.12.tar.gz.asc ... Skipped
mysqld-post.sh ... Passed
mysqld-tmpfile.conf ... Passed
mysqld.service ... Passed
==> Verifying source file signatures with gpg...
mysql-5.6.12.tar.gz ... FAILED (unknown public key 8C718D3B5072E1F5)
==> WARNING: Warnings have occurred while verifying the signatures.
Please make sure you really trust them.
==> Extracting sources...
-> Extracting mysql-5.6.12.tar.gz with bsdtar
==> Removing existing pkg/ directory...
==> Starting build()...
mkdir: cannot create directory ‘build’: File exists
==> ERROR: A failure occurred in build().
Aborting...
The build failed.
local database is up to date

How should I proceed?

rustam commented on 2013-06-13 09:07

Ah, I see now. On my systems it just throws a warning but doesn't prevent building, and I can see the same in the Arch wiki http://bit.ly/12oPo0W. Not sure why it's the error in your case. The reason for this verification failure is that Oracle's GPG keys are not added to the keyring. So, successful GPG checking would require you to manually init the keyring and import their key, run:

gpg --list-keys
gpg --recv-keys 8C718D3B5072E1F5

Then try installing aur/mysql again, it should resolve the problem. Probably I will need to drop gpg checking in this AUR package, as it makes no sense for me manually adding the signature, or build another package with their keyring and install it prior to MySQL installation as a dependency.

kralibes commented on 2013-06-13 06:13

With yaourt.

Now I see that it's not a checksum error but an error of failing gpg signature - sorry for this.

(german)
==> Überprüfe Signaturen der Quell-Dateien mit gpg...
mysql-5.6.11.tar.gz ... FEHLGESCHLAGEN
==> FEHLER: Eine oder mehrere PGP-Signaturen konnten nicht überprüft werden.
==> ERROR: Makepkg was unable to build mysql.
==> Restart building mysql ? [y/N]
==> ------------------------------

rustam commented on 2013-06-11 18:38

@kralibes: I see no issues with checksums; double checked it and it's valid and the package builds on my machines. Do you use yaourt or manually downloaded the pkgbuild and building in a directory with makepkg? In the latter case, try removing mysql-5.6.11.tar.gz and re-download it.