Warning: file_exists(): open_basedir restriction in effect. File(/srv/http/vhosts/aur.archlinux.org/public/web/locale//en/LC_MESSAGES/aurweb.mo) is not within the allowed path(s): (/srv/http/vhosts/aur-dev.archlinux.org/:/etc/aurweb/) in /srv/http/vhosts/aur-dev.archlinux.org/public/web/lib/streams.php on line 90
AUR (en) - java8-openjdk

Package Base Details: java8-openjdk

Git Clone URL: https://aur-dev.archlinux.org/java8-openjdk.git (read-only)
Keywords: fonts infinality java jdk jre
Submitter: chrbayer
Maintainer: None
Last Packager: gim
Votes: 25
Popularity: 2.553311
First Submitted: 2014-09-15 20:06
Last Updated: 2017-02-02 09:11

Pinned Comments

gim commented on 2016-02-22 14:07

Prebuilt packages by me are available at https://www.dropbox.com/sh/33ia4nzd2cdigvy/AADzw5132rjMLi5GhMKxgrOma?dl=0

Latest Comments

« First ‹ Previous ... 3 4 5 6 7 8 9 10 Next › Last »

jakub commented on 2015-02-24 22:40

I'm encountering some problems while trying to build, does anyone know whats wrong?

Probably because of /usr/bin/objcopy: 'libjvm.so': No such file

More detailed stack (some messages are in polish but I hope it will be useful anyway):

Making signal interposition lib...
Making SA debugger back-end...
**NOTICE** Dtrace support disabled: /usr/include/sys/sdt.h not found
Compiling /tmp/yaourt-tmp-kuba/aur-jdk8-openjdk-infinality/src/jdk8u-jdk8u31-b13/hotspot/src/share/vm/runtime/vm_version.cpp
Linking vm...
collect2: error: ld returned 1 exit status
/usr/bin/objcopy: 'libjvm.so': No such file
/tmp/yaourt-tmp-kuba/aur-jdk8-openjdk-infinality/src/jdk8u-jdk8u31-b13/hotspot/make/linux/makefiles/vm.make:325: polecenia dla obiektu 'libjvm.so' nie powiodły się
make[6]: *** [libjvm.so] Błąd 1
/tmp/yaourt-tmp-kuba/aur-jdk8-openjdk-infinality/src/jdk8u-jdk8u31-b13/hotspot/make/linux/makefiles/top.make:119: polecenia dla obiektu 'the_vm' nie powiodły się
make[5]: *** [the_vm] Błąd 2
/tmp/yaourt-tmp-kuba/aur-jdk8-openjdk-infinality/src/jdk8u-jdk8u31-b13/hotspot/make/linux/Makefile:293: polecenia dla obiektu 'product' nie powiodły się
make[4]: *** [product] Błąd 2
Makefile:228: polecenia dla obiektu 'generic_build2' nie powiodły się
make[3]: *** [generic_build2] Błąd 2
Makefile:175: polecenia dla obiektu 'product' nie powiodły się
make[2]: *** [product] Błąd 2
HotspotWrapper.gmk:44: polecenia dla obiektu '/tmp/yaourt-tmp-kuba/aur-jdk8-openjdk-infinality/src/jdk8u-jdk8u31-b13/build/linux-x86_64-normal-server-release/hotspot/_hotspot.timestamp' nie powiodły się
make[1]: *** [/tmp/yaourt-tmp-kuba/aur-jdk8-openjdk-infinality/src/jdk8u-jdk8u31-b13/build/linux-x86_64-normal-server-release/hotspot/_hotspot.timestamp] Błąd 2
/tmp/yaourt-tmp-kuba/aur-jdk8-openjdk-infinality/src/jdk8u-jdk8u31-b13//make/Main.gmk:108: polecenia dla obiektu 'hotspot-only' nie powiodły się
make: *** [hotspot-only] Błąd 2
==> BŁĄD: Wystąpił błąd w build().
Przerywam...
==> ERROR: Makepkg was unable to build java8-openjdk.
==> Restart building jdk8-openjdk-infinality ? [y/N]
==> ------------------------------------------------
==>

jakub commented on 2015-02-24 21:34

I encountering some problems while trying to build, does anyone know whats wrong?

Probably because of /usr/bin/objcopy: 'libjvm.so': No such file

More detailed stack:

Making signal interposition lib...
Making SA debugger back-end...
**NOTICE** Dtrace support disabled: /usr/include/sys/sdt.h not found
Compiling /tmp/yaourt-tmp-kuba/aur-jdk8-openjdk-infinality/src/jdk8u-jdk8u31-b13/hotspot/src/share/vm/runtime/vm_version.cpp
Linking vm...
collect2: error: ld returned 1 exit status
/usr/bin/objcopy: 'libjvm.so': No such file
/tmp/yaourt-tmp-kuba/aur-jdk8-openjdk-infinality/src/jdk8u-jdk8u31-b13/hotspot/make/linux/makefiles/vm.make:325: polecenia dla obiektu 'libjvm.so' nie powiodły się
make[6]: *** [libjvm.so] Błąd 1
/tmp/yaourt-tmp-kuba/aur-jdk8-openjdk-infinality/src/jdk8u-jdk8u31-b13/hotspot/make/linux/makefiles/top.make:119: polecenia dla obiektu 'the_vm' nie powiodły się
make[5]: *** [the_vm] Błąd 2
/tmp/yaourt-tmp-kuba/aur-jdk8-openjdk-infinality/src/jdk8u-jdk8u31-b13/hotspot/make/linux/Makefile:293: polecenia dla obiektu 'product' nie powiodły się
make[4]: *** [product] Błąd 2
Makefile:228: polecenia dla obiektu 'generic_build2' nie powiodły się
make[3]: *** [generic_build2] Błąd 2
Makefile:175: polecenia dla obiektu 'product' nie powiodły się
make[2]: *** [product] Błąd 2
HotspotWrapper.gmk:44: polecenia dla obiektu '/tmp/yaourt-tmp-kuba/aur-jdk8-openjdk-infinality/src/jdk8u-jdk8u31-b13/build/linux-x86_64-normal-server-release/hotspot/_hotspot.timestamp' nie powiodły się
make[1]: *** [/tmp/yaourt-tmp-kuba/aur-jdk8-openjdk-infinality/src/jdk8u-jdk8u31-b13/build/linux-x86_64-normal-server-release/hotspot/_hotspot.timestamp] Błąd 2
/tmp/yaourt-tmp-kuba/aur-jdk8-openjdk-infinality/src/jdk8u-jdk8u31-b13//make/Main.gmk:108: polecenia dla obiektu 'hotspot-only' nie powiodły się
make: *** [hotspot-only] Błąd 2
==> BŁĄD: Wystąpił błąd w build().
Przerywam...
==> ERROR: Makepkg was unable to build java8-openjdk.
==> Restart building jdk8-openjdk-infinality ? [y/N]
==> ------------------------------------------------
==>

jakub commented on 2015-02-24 21:33

I encountering some problems while trying to build, does anyone know whats wrong?

[code]
Making signal interposition lib...
Making SA debugger back-end...
**NOTICE** Dtrace support disabled: /usr/include/sys/sdt.h not found
Compiling /tmp/yaourt-tmp-kuba/aur-jdk8-openjdk-infinality/src/jdk8u-jdk8u31-b13/hotspot/src/share/vm/runtime/vm_version.cpp
Linking vm...
collect2: error: ld returned 1 exit status
/usr/bin/objcopy: 'libjvm.so': No such file
/tmp/yaourt-tmp-kuba/aur-jdk8-openjdk-infinality/src/jdk8u-jdk8u31-b13/hotspot/make/linux/makefiles/vm.make:325: polecenia dla obiektu 'libjvm.so' nie powiodły się
make[6]: *** [libjvm.so] Błąd 1
/tmp/yaourt-tmp-kuba/aur-jdk8-openjdk-infinality/src/jdk8u-jdk8u31-b13/hotspot/make/linux/makefiles/top.make:119: polecenia dla obiektu 'the_vm' nie powiodły się
make[5]: *** [the_vm] Błąd 2
/tmp/yaourt-tmp-kuba/aur-jdk8-openjdk-infinality/src/jdk8u-jdk8u31-b13/hotspot/make/linux/Makefile:293: polecenia dla obiektu 'product' nie powiodły się
make[4]: *** [product] Błąd 2
Makefile:228: polecenia dla obiektu 'generic_build2' nie powiodły się
make[3]: *** [generic_build2] Błąd 2
Makefile:175: polecenia dla obiektu 'product' nie powiodły się
make[2]: *** [product] Błąd 2
HotspotWrapper.gmk:44: polecenia dla obiektu '/tmp/yaourt-tmp-kuba/aur-jdk8-openjdk-infinality/src/jdk8u-jdk8u31-b13/build/linux-x86_64-normal-server-release/hotspot/_hotspot.timestamp' nie powiodły się
make[1]: *** [/tmp/yaourt-tmp-kuba/aur-jdk8-openjdk-infinality/src/jdk8u-jdk8u31-b13/build/linux-x86_64-normal-server-release/hotspot/_hotspot.timestamp] Błąd 2
/tmp/yaourt-tmp-kuba/aur-jdk8-openjdk-infinality/src/jdk8u-jdk8u31-b13//make/Main.gmk:108: polecenia dla obiektu 'hotspot-only' nie powiodły się
make: *** [hotspot-only] Błąd 2
==> BŁĄD: Wystąpił błąd w build().
Przerywam...
==> ERROR: Makepkg was unable to build java8-openjdk.
==> Restart building jdk8-openjdk-infinality ? [y/N]
==> ------------------------------------------------
==>
[/code]

gim commented on 2015-02-19 14:53

Finally good-looking fonts in JVM. Thanks!

chrbayer commented on 2015-02-17 07:10

I just use the package from the extra repository, if it will be included there, JMC will be included here. If you have a patch for this packages, I will try to include it earlier.

crew4ok commented on 2015-02-16 20:17

Any chances that JMC (Java Mission Control) will be included in the package?

bugabinga commented on 2015-01-16 13:17

Check out http://www.linuxfromscratch.org/blfs/view/svn/general/openjdk.html for a possible fix of giflib.

chrbayer commented on 2014-10-17 21:34

The line is not included because I is not included in the original 8u25 PKGBUILD file in the extra repository. But I will include it in new versions. Thanks, Christoph

mar04 commented on 2014-10-17 21:28

@whitebrice I didn't see that comment. It did build now, thanks!
@chrbayer Any reason why that line is not included in the PKGBUILD?

whitebrice commented on 2014-10-17 20:16

@mar04 Did you `unset _JAVA_OPTIONS` as Reihar suggested? I was getting that error until I did so.