Notice: Undefined variable: name in /srv/http/vhosts/ on line 248

Package Details: zathura-git

Git Clone URL: (read-only)
Package Base: zathura-git
Description: a document viewer
Upstream URL:
Licenses: custom
Conflicts: zathura
Provides: zathura
Submitter: None
Maintainer: mlq
Last Packager: mlq
Votes: 87
Popularity: 0.068455
First Submitted: 2009-09-19 13:00
Last Updated: 2015-11-25 18:07

Dependencies (10)

Sources (1)

Latest Comments

1 2 3 4 5 6 Next › Last »

HisDudeness commented on 2017-01-27 09:13

Maybe it has already been said, but trying to update zathura-git doesn't automatically update girara-git, and with an old version of it installing will fail.

The minimum required version of GIRARA is 0.2.7
make: *** [Makefile:63: .version-checks/GIRARA] Error 1
==> ERROR: A failure occurred in build().
==> ERROR: Makepkg was unable to build zathura-git.

ale1ster commented on 2016-06-09 21:25

The makedepends array does not contain the python requirements for building the documentation. Shouldn't they be included?
Also, since the required packages have had version upgrades shouldn't the checks be >= instead of specifying exact versions?

With these changes, the manpage files were built successfully.

killozap commented on 2015-12-10 22:14

updating from zathura-git fails with the error:

zathura/main.c: In function ‘init_zathura’:
zathura/main.c:89:11: warning: unused parameter ‘synctex_editor’ [-Wunused-parameter]
char* synctex_editor, Window embed)
zathura/main.c: In function ‘main’:
zathura/main.c:254:26: error: ‘synctex_editor’ undeclared (first use in this function)
plugin_path, argv, synctex_editor, embed);
zathura/main.c:254:26: note: each undeclared identifier is reported only once for each function it appears in
Makefile:103: recipe for target 'build/release/zathura/main.o' failed
make: *** [build/release/zathura/main.o] Error 1
==> ERROR: A failure occurred in build().

Any ideas?

yar commented on 2015-12-01 19:44

Girara dependency should be versioned, like: depends=('girara-git>=0.2.4')

Awebb commented on 2015-05-06 08:27

For reasons beyond my comprehension, zathura builds against libnotify, even if libnotify is not present. The vanilla Arch version does not. It looks like girara-git now depends on libnotify, but does not have it in its dep array. I'm currently trying to build it without libnotify present, to see if it's an autoconf problem or something like that.

mkaito commented on 2015-03-04 15:08

Does anyone else get undefined references from libgdk?

[CC] /tmp/yaourt-tmp-chris/aur-zathura-git/release/bin/zathura
/usr/lib/ undefined reference to `cairo_surface_set_device_scale'
/usr/lib/ undefined reference to `cairo_surface_get_device_scale'

isavour commented on 2014-11-23 20:23

Does this git version has pdf annotation and highlight support now?

Stalafin commented on 2014-05-28 17:43

zathura-git does not build with the latest girara-common-git and girara-gtk3-git.

Here is the error message:
[CC] zathura
commands.o: In function `cmd_exec':
commands.c:(.text+0x1321): undefined reference to `girara_replace_substring'
zathura.o: In function `zathura_init':
zathura.c:(.text+0x791): undefined reference to `girara_session_get_template'
zathura.c:(.text+0x7a7): undefined reference to `girara_template_add_variable'
zathura.c:(.text+0x821): undefined reference to `girara_template_set_variable_value'
zathura.c:(.text+0x842): undefined reference to `girara_template_get_base'
zathura.c:(.text+0x862): undefined reference to `girara_template_set_base'
collect2: error: ld returned 1 exit status
Makefile:98: recipe for target 'zathura' failed
make: *** [zathura] Error 1
==> ERROR: A failure occurred in build().

aignas commented on 2014-01-07 21:31


I have updated this and some other PKGBUILDs a while ago and I am hapilly using it. If somebody is interested:

You can find a few more related updates (girara-gtk3, girara-common, zathura-plugins) in:

I hope that becomes useful...


yar commented on 2013-12-25 21:06

Any thoughts about tracking the develop branch?


It seems to have a month's worth of fixes that aren't in master.