Warning: file_exists(): open_basedir restriction in effect. File(/srv/http/vhosts/aur.archlinux.org/public/web/locale//en/LC_MESSAGES/aurweb.mo) is not within the allowed path(s): (/srv/http/vhosts/aur-dev.archlinux.org/:/etc/aurweb/) in /srv/http/vhosts/aur-dev.archlinux.org/public/web/lib/streams.php on line 90
AUR (en) - xournalpp-git

Notice: Undefined variable: name in /srv/http/vhosts/aur-dev.archlinux.org/public/web/lib/pkgfuncs.inc.php on line 248

Package Details: xournalpp-git 1.0.0.333.g38d235d-1

Git Clone URL: https://aur-dev.archlinux.org/xournalpp-git.git (read-only)
Package Base: xournalpp-git
Description: C++ re-write of tablet notetaking app Xournal
Upstream URL: https://github.com/xournalpp/xournalpp
Licenses: GPL3
Conflicts: xournal, xournal-dmgerman, xournal-image-patched, xournalpp, xournalpp-svn
Provides: xournal=1.0.0.333.g38d235d, xournal-dmgerman=1.0.0.333.g38d235d xournalpp=1.0.0.333.g38d235d
Submitter: ridikulusrat
Maintainer: quininer
Last Packager: quininer
Votes: 4
Popularity: 0.003347
First Submitted: 2015-10-18 01:29
Last Updated: 2016-12-18 12:01

Latest Comments

golvok commented on 2017-01-09 21:35

Heads up to latex users: The support for it must be compiled in, and quininer disabled that in the PKGBUILD in the 2016-11-30 update. To re-enable, change -DENABLE_MATHTEX="OFF" to ON in build().

quininer commented on 2016-10-21 07:20

@mokasin
This is the decision before the maintainer, I don't know the reason...

ridikulusrat commented on 2016-03-23 00:07

Due to work and other life commitments, I am unable to devote time to maintain this package. Orphaned.

jaf7 commented on 2016-03-22 02:24

Sucessfully building with two edits to source.
See here for details:
https://github.com/xournalpp/xournalpp/issues/167

ziekke commented on 2016-03-12 15:36

Error here also

/var/tmp/yaourt-tmp-username/aur-xournalpp-git/src/xournalpp/src/control/tools/EditSelectionContents.cpp: In member function ‘UndoAction* EditSelectionContents::setFont(XojFont&)’:
/var/tmp/yaourt-tmp-username/aur-xournalpp-git/src/xournalpp/src/control/tools/EditSelectionContents.cpp:174:16: error: ‘isnan’ was not declared in this scope
if (isnan(x1))
^
/var/tmp/yaourt-tmp-username/aur-xournalpp-git/src/xournalpp/src/control/tools/EditSelectionContents.cpp:174:16: note: suggested alternative:
In file included from /usr/include/c++/5.3.0/random:38:0,
from /usr/include/c++/5.3.0/bits/stl_algo.h:66,
from /usr/include/c++/5.3.0/algorithm:62,
from /usr/include/c++/5.3.0/ext/slist:47,
from /usr/include/boost/algorithm/string/std/slist_traits.hpp:16,
from /usr/include/boost/algorithm/string/std_containers_traits.hpp:23,
from /usr/include/boost/algorithm/string.hpp:18,
from /var/tmp/yaourt-tmp-username/aur-xournalpp-git/src/xournalpp/src/util/StringUtils.h:16,
from /var/tmp/yaourt-tmp-username/aur-xournalpp-git/src/xournalpp/src/control/Tool.h:14,
from /var/tmp/yaourt-tmp-username/aur-xournalpp-git/src/xournalpp/src/control/tools/EditSelectionContents.h:16,
from /var/tmp/yaourt-tmp-username/aur-xournalpp-git/src/xournalpp/src/control/tools/EditSelectionContents.cpp:1:
/usr/include/c++/5.3.0/cmath:641:5: note: ‘std::isnan’
isnan(_Tp __x)
^
/var/tmp/yaourt-tmp-username/aur-xournalpp-git/src/xournalpp/src/control/tools/EditSelectionContents.cpp:202:15: error: ‘isnan’ was not declared in this scope
if (!isnan(x1))
^
/var/tmp/yaourt-tmp-username/aur-xournalpp-git/src/xournalpp/src/control/tools/EditSelectionContents.cpp:202:15: note: suggested alternative:
In file included from /usr/include/c++/5.3.0/random:38:0,
from /usr/include/c++/5.3.0/bits/stl_algo.h:66,
from /usr/include/c++/5.3.0/algorithm:62,
from /usr/include/c++/5.3.0/ext/slist:47,
from /usr/include/boost/algorithm/string/std/slist_traits.hpp:16,
from /usr/include/boost/algorithm/string/std_containers_traits.hpp:23,
from /usr/include/boost/algorithm/string.hpp:18,
from /var/tmp/yaourt-tmp-username/aur-xournalpp-git/src/xournalpp/src/util/StringUtils.h:16,
from /var/tmp/yaourt-tmp-username/aur-xournalpp-git/src/xournalpp/src/control/Tool.h:14,
from /var/tmp/yaourt-tmp-username/aur-xournalpp-git/src/xournalpp/src/control/tools/EditSelectionContents.h:16,
from /var/tmp/yaourt-tmp-username/aur-xournalpp-git/src/xournalpp/src/control/tools/EditSelectionContents.cpp:1:
/usr/include/c++/5.3.0/cmath:641:5: note: ‘std::isnan’
isnan(_Tp __x)
^
src/CMakeFiles/xournalpp-core.dir/build.make:926: recipe for target 'src/CMakeFiles/xournalpp-core.dir/control/tools/EditSelectionContents.cpp.o' failed
make[2]: *** [src/CMakeFiles/xournalpp-core.dir/control/tools/EditSelectionContents.cpp.o] Error 1
CMakeFiles/Makefile2:386: recipe for target 'src/CMakeFiles/xournalpp-core.dir/all' failed
make[1]: *** [src/CMakeFiles/xournalpp-core.dir/all] Error 2
Makefile:127: recipe for target 'all' failed
make: *** [all] Error 2

Daedalus24 commented on 2016-03-10 18:17

There is an error

/usr/include/c++/5.3.0/cmath:641:5: note: ‘std::isnan’
isnan(_Tp __x)
^
/tmp/yaourt-tmp-.../aur-xournalpp-git/src/xournalpp/src/control/tools/EditSelectionContents.cpp:202:15: error: ‘isnan’ was not declared in this scope
if (!isnan(x1))
^
/tmp/yaourt-tmp-.../aur-xournalpp-git/src/xournalpp/src/control/tools/EditSelectionContents.cpp:202:15: note: suggested alternative:
In file included from /usr/include/c++/5.3.0/random:38:0,
from /usr/include/c++/5.3.0/bits/stl_algo.h:66,
from /usr/include/c++/5.3.0/algorithm:62,
from /usr/include/c++/5.3.0/ext/slist:47,
from /usr/include/boost/algorithm/string/std/slist_traits.hpp:16,
from /usr/include/boost/algorithm/string/std_containers_traits.hpp:23,
from /usr/include/boost/algorithm/string.hpp:18,
from /tmp/yaourt-tmp-unicornis65/aur-xournalpp-git/src/xournalpp/src/util/StringUtils.h:16,
from /tmp/yaourt-tmp-unicornis65/aur-xournalpp-git/src/xournalpp/src/control/Tool.h:14,
from /tmp/yaourt-tmp-unicornis65/aur-xournalpp-git/src/xournalpp/src/control/tools/EditSelectionContents.h:16,
from /tmp/yaourt-tmp-unicornis65/aur-xournalpp-git/src/xournalpp/src/control/tools/EditSelectionContents.cpp:1:
/usr/include/c++/5.3.0/cmath:641:5: note: ‘std::isnan’
isnan(_Tp __x)
^
src/CMakeFiles/xournalpp-core.dir/build.make:854: recipe for target 'src/CMakeFiles/xournalpp-core.dir/control/tools/EditSelectionContents.cpp.o' failed
make[2]: *** [src/CMakeFiles/xournalpp-core.dir/control/tools/EditSelectionContents.cpp.o] Error 1
CMakeFiles/Makefile2:386: recipe for target 'src/CMakeFiles/xournalpp-core.dir/all' failed
make[1]: *** [src/CMakeFiles/xournalpp-core.dir/all] Error 2

sadid commented on 2015-10-18 04:42

I get a segmentation fault during compile:
https://gist.github.com/sadid/88d19c646667c4eff6ea