Warning: file_exists(): open_basedir restriction in effect. File(/srv/http/vhosts/aur.archlinux.org/public/web/locale//en/LC_MESSAGES/aurweb.mo) is not within the allowed path(s): (/srv/http/vhosts/aur-dev.archlinux.org/:/etc/aurweb/) in /srv/http/vhosts/aur-dev.archlinux.org/public/web/lib/streams.php on line 90
AUR (en) - wxsvg

Notice: Undefined variable: name in /srv/http/vhosts/aur-dev.archlinux.org/public/web/lib/pkgfuncs.inc.php on line 248

Package Details: wxsvg 1.5.11-1

Git Clone URL: https://aur-dev.archlinux.org/wxsvg.git (read-only)
Package Base: wxsvg
Description: C++ library to create, manipulate and render SVG files
Upstream URL: http://wxsvg.sourceforge.net/
Licenses: custom:wxWindows
Submitter: xyproto
Maintainer: migrev
Last Packager: migrev
Votes: 55
Popularity: 0.246927
First Submitted: 2011-12-14 17:07
Last Updated: 2017-01-16 10:27

Latest Comments

1 2 3 Next › Last »

tomx3 commented on 2017-01-18 08:35

libexif is missing in dependencies.

migrev commented on 2016-11-14 13:50

Apart from the missing libexif dependency (which will fix with a -r2), I'm unable of reproducing the compile fail. In my system everthing compiles, links and packages smoothly. Anyone else can confirm the fail? Thx.

keepitsimpleengr commented on 2016-11-14 12:25

Still failing.
Output of yaourt at http://pastebin.com/8nSQUEhL

keepitsimpleengr commented on 2016-11-10 17:04

Still... .. .
==> ERROR: Makepkg was unable to build wxsvg.

andreas_baumann commented on 2016-11-08 19:51

missing a dependency to 'libexif':

checking for LIBEXIF... no
configure: error: *** missing libexif ***

keepitsimpleengr commented on 2016-11-07 14:57

/usr/bin/ld: final link failed: Bad value
collect2: error: ld returned 1 exit status
make[2]: *** [Makefile:536: libwxsvg.la] Error 1
make[2]: Leaving directory '/tmp/yaourt-tmp-ljohnson/aur-wxsvg/src/wxsvg-1.5.10/src'
make[1]: *** [Makefile:637: all-recursive] Error 1
make[1]: Leaving directory '/tmp/yaourt-tmp-ljohnson/aur-wxsvg/src/wxsvg-1.5.10/src'
make: *** [Makefile:468: all-recursive] Error 1
==> ERROR: A failure occurred in build().
==> ERROR: Makepkg was unable to build wxsvg.


zoe commented on 2016-07-06 08:25

Version 1.5.8 is available

mnovick1988 commented on 2016-02-07 17:00

upstream is using wrong enum() type{PIX_FMT_RGB24}. wont compile against recent ffmpeg.

osc commented on 2014-09-30 15:33

updated to version 1.5:


hepha commented on 2013-10-20 18:17

/usr/sbin/ld: /usr/lib/gcc/x86_64-unknown-linux-gnu/4.8.2/../../../../lib/libavformat.a(allformats.o): relocation R_X86_64_32 against `ff_a64_muxer' can not be used when making a shared object; recompile with -fPIC
/usr/lib/gcc/x86_64-unknown-linux-gnu/4.8.2/../../../../lib/libavformat.a: could not read symbols: Bad value
collect2: error: ld returned 1 exit status
make[2]: *** [libwxsvg.la] Error 1