Warning: file_exists(): open_basedir restriction in effect. File(/srv/http/vhosts/aur.archlinux.org/public/web/locale//en/LC_MESSAGES/aurweb.mo) is not within the allowed path(s): (/srv/http/vhosts/aur-dev.archlinux.org/:/etc/aurweb/) in /srv/http/vhosts/aur-dev.archlinux.org/public/web/lib/streams.php on line 90
AUR (en) - wine-git

Notice: Undefined variable: name in /srv/http/vhosts/aur-dev.archlinux.org/public/web/lib/pkgfuncs.inc.php on line 248

Package Details: wine-git 1.9.24.r105.g1d3b944-4

Git Clone URL: https://aur-dev.archlinux.org/wine-git.git (read-only)
Package Base: wine-git
Description: A compatibility layer for running Windows programs. GIT version.
Upstream URL: http://www.winehq.com
Licenses: LGPL
Conflicts: bin32-wine, wine, wine-wow64
Provides: bin32-wine=1.9.24.r105.g1d3b944, wine=1.9.24.r105.g1d3b944, wine-wow64=1.9.24.r105.g1d3b944
Replaces: bin32-wine
Submitter: None
Maintainer: sidneycrestani
Last Packager: sidneycrestani
Votes: 78
Popularity: 0.297120
First Submitted: 2007-07-18 16:01
Last Updated: 2016-12-06 00:30

Dependencies (138)

Required by (119)

Sources (2)

Latest Comments

« First ‹ Previous 1 2 3 4 5 6 7 8 9 ... Next › Last »

Wintershade commented on 2013-04-21 10:03

Hello, I'm having trouble with this package, as well as the stock WINE package from [multilib]. Essentially, winecfg and wineboot (and supposedly ALSA) fail on a 64-bit wineprefix. There are three of us (that I know) currently experiencing this problem.
I've opened a thread in the Arch BBS, if you'd like to check it out (I'd be very grateful):

https://bbs.archlinux.org/viewtopic.php?pid=1261668

TIA :)

sxe commented on 2013-04-20 10:19

As Adys suggested the package now uses the new vcs PKGBUILD functionality.

Furthermore i merged the PKGBUILD with the latest changes from the wine PKGBUILD.

Greetings

jleclanche commented on 2013-04-19 22:20

With pacman 4.1, this could benefit from the new-style vcs pkgbuilds.

Anonymous comment on 2013-03-15 00:16

I receive this when I attempt to compile:

../../wine-git/include/objidl.idl:32: error: syntax error, unexpected aIDENTIFIER
make[1]: *** [netcon.h] Error 1
make[1]: Leaving directory `/var/abs/local/yaourtbuild/wine-git/src/wine-git-64-build/include'
make: *** [include] Error 2

sxe commented on 2013-01-02 11:11

Merged the latest wine PKGBUILD changes.

@TheJJ
Thx for the suggestion, seems a good idea, i have added it.

quetzal commented on 2012-12-19 18:00

Libs are missing on 64bits (not on the repo) lib32-giflib lib32-libxmu lib32-libxml2 lib32-lcms lib32-mpg123

TheJJ commented on 2012-10-05 23:17

to speed up downloading, you could enable shallow cloning: git clone --depth 1

kamiljk87 commented on 2012-09-06 13:06

Missing drive detection in winecfg Hard Drives... Any extra packages needed?

kamiljk87 commented on 2012-09-05 19:36

Compiled successful, but in dependencies on 64bit also good to know need multilib repository enabled.

sxe commented on 2012-07-27 18:23

No problem here. Builds just fine.
What is the error message?