Warning: file_exists(): open_basedir restriction in effect. File(/srv/http/vhosts/aur.archlinux.org/public/web/locale//en/LC_MESSAGES/aurweb.mo) is not within the allowed path(s): (/srv/http/vhosts/aur-dev.archlinux.org/:/etc/aurweb/) in /srv/http/vhosts/aur-dev.archlinux.org/public/web/lib/streams.php on line 90
AUR (en) - wimlib

Notice: Undefined variable: name in /srv/http/vhosts/aur-dev.archlinux.org/public/web/lib/pkgfuncs.inc.php on line 248

Package Details: wimlib 1.11.0-1

Git Clone URL: https://aur-dev.archlinux.org/wimlib.git (read-only)
Package Base: wimlib
Description: A library and program to extract, create, and modify WIM files
Upstream URL: https://wimlib.net
Licenses: custom
Submitter: Synchronicity
Maintainer: Synchronicity
Last Packager: Synchronicity
Votes: 63
Popularity: 1.137164
First Submitted: 2012-05-02 03:25
Last Updated: 2017-01-18 06:53

Dependencies (9)

Required by (0)

Sources (1)

Latest Comments

1 2 3 4 Next › Last »

rasoran commented on 2017-01-22 00:12

wimlib 1.11.0-1 is failing a test

FAIL: tests/test-imagex-mount

swiftgeek commented on 2016-05-19 09:48

Got new issue - due to GUID not being the same as boot.wim from source Win10 install image, mkwinpeimg creates unbootable image :(
EDIT:Sorry i think i made the same mistake again - it requires mbr partition scheme to boot, no change to bcd needed

tancrackers commented on 2016-03-12 22:45

Weird. It worked now O_o

Synchronicity commented on 2016-03-12 15:22

Please send me your test-suite.log.

tancrackers commented on 2016-03-12 12:19

I get this error:

Makefile:2063: recipe for target 'test-suite.log' failed
make[2]: *** [test-suite.log] Error 1
make[2]: Leaving directory '/tmp/yaourt-tmp-john/aur-wimlib/src/wimlib-1.9.1'
Makefile:2169: recipe for target 'check-TESTS' failed
make[1]: *** [check-TESTS] Error 2
make[1]: Leaving directory '/tmp/yaourt-tmp-john/aur-wimlib/src/wimlib-1.9.1'
Makefile:2403: recipe for target 'check-am' failed
make: *** [check-am] Error 2

Synchronicity commented on 2016-02-02 01:19

Thanks. I will remove ntfsprogs from the PKGBUILD in the next version.

chungy commented on 2016-02-01 15:59

ntfsprogs can be removed from the optdepends. They've been part of ntfs-3g for a while now.

Synchronicity commented on 2015-11-14 20:36

v1.8.3 of the package, just uploaded, addresses the issue reported earlier in these comments by 'techryda'.

Synchronicity commented on 2015-08-11 14:56

Thanks for the report. The failure was caused by the FUSE device not being available to run the WIM mounting tests. It's not wimlib's responsibility to make sure that the FUSE device is available. However, I might change the test to be skipped in the case where the FUSE device isn't available (the NTFS capture/apply test currently has that behavior and was skipped rather than failed).

Users who do not want WIM mounting support also have the option of configuring wimlib --without-fuse.

tancrackers commented on 2015-08-11 12:29

I was using grsec kernel, and realized that that may have caused the error. The package installed just fine under the default Arch kernel. I'll email you the log anyway, if you want to see.