Notice: Undefined variable: name in /srv/http/vhosts/aur-dev.archlinux.org/public/web/lib/pkgfuncs.inc.php on line 248

Package Details: widelands-bzr r7282-2

Git Clone URL: https://aur-dev.archlinux.org/widelands-bzr.git (read-only)
Package Base: widelands-bzr
Description: A realtime strategy game with emphasis on economy and transport - development version
Upstream URL: http://wl.widelands.org
Licenses: GPL2
Conflicts: widelands, widelands-data
Provides: widelands
Submitter: matthiaskrgr
Maintainer: gamag
Last Packager: gamag
Votes: 4
Popularity: 0.574482
First Submitted: 2012-04-21 17:53
Last Updated: 2015-06-10 19:17

Required by (0)

Sources (1)

Latest Comments

« First ‹ Previous 1 2 3

matthiaskrgr commented on 2013-10-25 20:09

Mmh no idea. Maybe try again later?
I had cloned the repo some time ago and pulling still seems to work.

TiborB commented on 2013-10-25 19:20

Hi,

it failed with:

You have not informed bzr of your Launchpad ID, and you must do this to
write to Launchpad or access private data. See "bzr help launchpad-login".
bzr: ERROR: No such file: 'http://bazaar.launchpad.net/~widelands-dev/widelands/trunk/.bzr/repository/pack-names'

Any idea what is wrong?

matthiaskrgr commented on 2013-05-01 12:50

widelands does only build with lua 5.1 (it fails if you have 5.2 and 5.1 installed).

I'm waiting for an upstream fix.

MelTraX commented on 2013-04-28 20:30

Compilation fails at the moment:

[ 82%] Building CXX object src/CMakeFiles/widelands_all.dir/logic/worker_descr.cc.o
In file included from /tmp/yaourt-tmp-meltrax/aur-widelands-bzr/src/widelands-build/src/logic/worker_descr.cc:37:0:
/tmp/yaourt-tmp-meltrax/aur-widelands-bzr/src/widelands-build/src/scripting/pdep/llimits.h:18:9: error: ‘LUAI_UINT32’ does not name a type
typedef LUAI_UINT32 lu_int32;
^
/tmp/yaourt-tmp-meltrax/aur-widelands-bzr/src/widelands-build/src/scripting/pdep/llimits.h:47:9: error: ‘LUAI_USER_ALIGNMENT_T’ does not name a type
typedef LUAI_USER_ALIGNMENT_T L_Umaxalign;
^
/tmp/yaourt-tmp-meltrax/aur-widelands-bzr/src/widelands-build/src/scripting/pdep/llimits.h:88:9: error: ‘lu_int32’ does not name a type
typedef lu_int32 Instruction;
^
make[2]: *** [src/CMakeFiles/widelands_all.dir/logic/worker_descr.cc.o] Error 1
make[1]: *** [src/CMakeFiles/widelands_all.dir/all] Error 2
make: *** [all] Error 2
==> ERROR: A failure occurred in build().