Warning: file_exists(): open_basedir restriction in effect. File(/srv/http/vhosts/aur.archlinux.org/public/web/locale//en/LC_MESSAGES/aurweb.mo) is not within the allowed path(s): (/srv/http/vhosts/aur-dev.archlinux.org/:/etc/aurweb/) in /srv/http/vhosts/aur-dev.archlinux.org/public/web/lib/streams.php on line 90
AUR (en) - unarchiver

Notice: Undefined variable: name in /srv/http/vhosts/aur-dev.archlinux.org/public/web/lib/pkgfuncs.inc.php on line 248

Package Details: unarchiver 1:1.10.1-1

Git Clone URL: https://aur-dev.archlinux.org/unarchiver.git (read-only)
Package Base: unarchiver
Description: unar and lsar: Objective-C tools for uncompressing archive files
Upstream URL: http://unarchiver.c3.cx/
Licenses: LGPL2.1
Submitter: cgirard
Maintainer: cgirard
Last Packager: cgirard
Votes: 63
Popularity: 0.885094
First Submitted: 2011-04-06 12:38
Last Updated: 2016-05-26 08:42

Latest Comments

1 2 3 4 Next › Last »

eang commented on 2016-03-10 09:35

You're right :(
The PKGBUILD I linked installs libgnustep-base.so.1.24 under /usr/lib/unarchiver, which is not a good thing to do... (and indeed, namcap complains about it).

cgirard commented on 2016-02-29 14:59

@elv: I confirm daimonion observation
ldd /usr/bin/unar => [...]/usr/lib/libgnustep-base.so.1.24[...]

daimonion commented on 2016-02-28 16:10

I uninstalled gnustep-base and this is a result:

unar: error while loading shared libraries: libgnustep-base.so.1.24: cannot open shared object file: No such file or directory

eang commented on 2016-02-28 15:38

@cgirard: could you please move gnustep-base to makedepends? It is actually a build dependency and not a runtime one. See also this pkgbuild [1] which builds and works just fine.

[1]: https://build.opensuse.org/package/view_file/home:mazdlc/unarchiver-nodep/PKGBUILD?expand=1

GuestOne commented on 2013-11-07 15:04

Please update to 1.8.1 http://theunarchiver.googlecode.com/files/unar1.8.1_src.zip

rtfreedman commented on 2013-09-11 16:14

I've tried right after updating gnustep libs yesterday and failed.
Now I've tried again and succeeded... strange!
Sorry for the noise.

cgirard commented on 2013-09-10 21:04

Strange. It works for me and functions.h is in The Unarchiver/XADMaster/libxad/include/ so it should be found.

rtfreedman commented on 2013-09-10 19:42

Doesn't build anymore:
libxad/debug.c:26:23: fatal error: functions.h: No such file or directory
#include "functions.h"
compilation terminated.
make: *** [Build/libxad/all.o] Error 1
==> ERROR: A failure occurred in build().

cgirard commented on 2013-05-14 11:40

@dx: I modified the description to include unar & lsar in it.

dequis commented on 2013-05-12 09:37

You should name this package "unar" then, or at least mention in the description that it's not the mac OS X app called "unarchiver" and that it includes unar and lsar. I was looking for the commandline tool and was confused about this package, had to check the PKGBUILD to confirm. But it was what I need, so thanks for maintaining this.