Notice: Undefined variable: name in /srv/http/vhosts/aur-dev.archlinux.org/public/web/lib/pkgfuncs.inc.php on line 248

Package Details: tuxonice-userui 1.1.65200132-1

Git Clone URL: https://aur-dev.archlinux.org/tuxonice-userui.git (read-only)
Package Base: tuxonice-userui
Description: TuxOnIce userspace user interface
Upstream URL: https://github.com/NigelCunningham/Tuxonice-Userui
Licenses: GPL
Submitter: Snowman
Maintainer: gdamjan
Last Packager: gdamjan
Votes: 103
Popularity: 0.774138
First Submitted: 2009-03-12 03:19
Last Updated: 2016-02-07 21:52

Latest Comments

« First ‹ Previous 1 2 3 4 5 6 7 Next › Last »

mikroskeem commented on 2015-06-21 23:59

/tmp/yaourt-tmp-mark/aur-tuxonice-userui/src/Tuxonice-Userui-1.1.1/fbsplash/image.c:67: undefined reference to `put_pixel'

Won't compile anymore

mikroskeem commented on 2015-06-21 23:58

cc -march=x86-64 -mtune=generic -O2 -pipe -fstack-protector-strong --param=ssp-buffer-size=4 -Wall -O3 -DUSE_FBSPLASH -Wall -O3 -g -I/usr/include/freetype2/ -I. -c ttf.c -o ttf.o
ttf.c: In function ‘Load_Glyph’:
ttf.c:371:4: warning: implicit declaration of function ‘FT_Outline_Transform’ [-Wimplicit-function-declaration]
FT_Outline_Transform(outline, &shear);
^
In file included from ttf.c:32:0:
ttf.c: At top level:
splash.h:232:13: warning: inline function ‘put_pixel’ declared but never defined
inline void put_pixel (u8 a, u8 r, u8 g, u8 b, u8 *src, u8 *dst, u8 add);
^
cc -Wl,-O1,--sort-common,--as-needed,-z,relro -r -nostdlib -nostartfiles userui_fbsplash_core.o cmd.o common.o effects.o image.o list.o parse.o mng_callbacks.o mng_render.o render.o ttf.o -o userui_fbsplash.o
make[1]: Leaving directory '/tmp/yaourt-tmp-mark/aur-tuxonice-userui/src/Tuxonice-Userui-1.1.1/fbsplash'
cc -Wl,-O1,--sort-common,--as-needed,-z,relro userui_core.o userui_text.o fbsplash/userui_fbsplash.o -lmng -lpng -ljpeg -lfreetype -lm -o tuxoniceui
fbsplash/userui_fbsplash.o: In function `truecolor2fb':
/tmp/yaourt-tmp-mark/aur-tuxonice-userui/src/Tuxonice-Userui-1.1.1/fbsplash/image.c:67: undefined reference to `put_pixel'
/tmp/yaourt-tmp-mark/aur-tuxonice-userui/src/Tuxonice-Userui-1.1.1/fbsplash/image.c:67: undefined reference to `put_pixel'
/tmp/yaourt-tmp-mark/aur-tuxonice-userui/src/Tuxonice-Userui-1.1.1/fbsplash/image.c:64: undefined reference to `put_pixel'
/tmp/yaourt-tmp-mark/aur-tuxonice-userui/src/Tuxonice-Userui-1.1.1/fbsplash/image.c:67: undefined reference to `put_pixel'
/tmp/yaourt-tmp-mark/aur-tuxonice-userui/src/Tuxonice-Userui-1.1.1/fbsplash/image.c:67: undefined reference to `put_pixel'
fbsplash/userui_fbsplash.o:/tmp/yaourt-tmp-mark/aur-tuxonice-userui/src/Tuxonice-Userui-1.1.1/fbsplash/ttf.c:667: more undefined references to `put_pixel' follow
collect2: error: ld returned 1 exit status
Makefile:45: recipe for target 'tuxoniceui' failed
make: *** [tuxoniceui] Error 1
==> ERROR: A failure occurred in build().
Aborting...

gdamjan commented on 2014-08-11 17:12

I have a github fork with those patches.
https://github.com/gdamjan/Tuxonice-Userui/commit/ed1b73cf2f073f39200be79c633deb292cb8d4af

I'll just update the PKGBUILD to use that fork

acaccia commented on 2014-08-11 17:09

Hi,
I've created patches to fix includes for myself ; I thought I'd share it with you :-)

Add file "patch_ttfc.txt" containing : http://paste.awesom.eu/0BZz&ln ;
file "patch_ttfh.txt" containing : http://paste.awesom.eu/IhzD&ln ;
and updated PKGBUILD : http://paste.awesom.eu/aCEU&ln

depaiao commented on 2014-08-10 04:12

please upgrade

AdmiralAkber commented on 2014-01-10 17:15

The easiest solution I've found was simply to sym link /usr/include/freetype2 to /usr/include/freetype temporarily for the build.

GottZ commented on 2014-01-07 20:54

in ttf.c and ttf.h just remove freetype/ from the includes and voila. compiles fine.

gdamjan commented on 2014-01-06 02:02

A quick fix is to replace the include with:

#include <ft2build.h>
#include FT_FREETYPE_H

I'll see if upstream will apply the patch or I'll need to fork the repo.

AdmiralAkber commented on 2014-01-05 03:27

Build fails with error:

make -C fbsplash
make[1]: Entering directory '/tmp/packerbuild-1000/tuxonice-userui/tuxonice-userui/src/NigelCunningham-Tuxonice-Userui-c3bdd83/fbsplash'
cc -march=x86-64 -mtune=generic -O2 -pipe -fstack-protector --param=ssp-buffer-size=4 -Wall -O3 -DUSE_FBSPLASH -Wall -O3 -g -I/usr/include/freetype2/ -I. -c userui_fbsplash_core.c -o userui_fbsplash_core.o
In file included from splash.h:147:0,
from userui_fbsplash_core.c:28:
ttf.h:4:30: fatal error: freetype/ftoutln.h: No such file or directory
#include <freetype/ftoutln.h>

nous commented on 2013-09-12 19:42

http://dl.dropboxusercontent.com/u/11734958/tuxonice-splash.tar.xz