Warning: file_exists(): open_basedir restriction in effect. File(/srv/http/vhosts/aur.archlinux.org/public/web/locale//en/LC_MESSAGES/aurweb.mo) is not within the allowed path(s): (/srv/http/vhosts/aur-dev.archlinux.org/:/etc/aurweb/) in /srv/http/vhosts/aur-dev.archlinux.org/public/web/lib/streams.php on line 90
AUR (en) - ttfautohint

Notice: Undefined variable: name in /srv/http/vhosts/aur-dev.archlinux.org/public/web/lib/pkgfuncs.inc.php on line 248

Package Details: ttfautohint 1.6-1

Git Clone URL: https://aur-dev.archlinux.org/ttfautohint.git (read-only)
Package Base: ttfautohint
Description: Provides automated hinting process for web fonts.
Upstream URL: http://www.freetype.org/ttfautohint/
Licenses: GPL, custom
Submitter: roentgen
Maintainer: supermario
Last Packager: supermario
Votes: 22
Popularity: 1.099113
First Submitted: 2013-01-06 15:15
Last Updated: 2016-12-15 23:44

Pinned Comments

supermario commented on 2016-03-07 22:54

Please make sure that you import the pgp key before trying to build this package:

gpg --key-server --recv-keys C1A60EACE707FDA5

Latest Comments

1 2 Next › Last »

supermario commented on 2016-03-07 22:54

Please make sure that you import the pgp key before trying to build this package:

gpg --key-server --recv-keys C1A60EACE707FDA5

roentgen commented on 2015-03-26 19:52

Disowning as I don't have time for it.

roentgen commented on 2015-02-16 07:28

Hi guys. I'm on it. Sorry for the delay.

rosshadden commented on 2015-02-15 17:58

I get a `FAILED (unknown public key ...)` error when installing this.

I know that's what @arielp is saying too. What I do not know is how to get around it.

arielp commented on 2015-01-30 19:48

How about adding a 'validpgpkeys' line in the PKGBUILD?


roentgen commented on 2013-04-03 18:47

supersym, thanks, I fixed it.

supersym commented on 2013-04-02 22:39

You should change the line with cmd 'qmake4' to 'qmake-qt4'

roentgen commented on 2013-02-27 20:08

I've made some changes in order to build with qt4 (currently in testing).

roentgen commented on 2013-02-08 18:57

I have to admit I didn't test building the docs with those optional deps.

Having a quick look at it now it seems quite a mess to deal with the haskell stuff or the non-haskell pandoc (which needs haskell stuff to build anyway).


Anonymous comment on 2013-02-07 18:06

I'm uncertain about what to do about the following phenomenon, as it's an issue related to an optional dependency.

If pandoc is installed (from the haskell repo), the build fails complaining to the lack of libertine.sty unless texlive-fontsextra is installed. If texlive-fontsextra is installed, the build fails with the following error:

make[2]: Entering directory `/home/csaba/pkg/packer/packerbuild-1000/ttfautohint/ttfautohint/src/ttfautohint-0.94/doc'
ghc -dynamic --make handle-images
[1 of 1] Compiling Main ( handle-images.hs, handle-images.o )
Linking handle-images ...
pandoc --to=json \
--smart \
ttfautohint.txt \
| ./handle-images ".svg" \
| pandoc --from=json \
--template=./template.html \
--variable="version:0.94" \
--toc \
--include-in-header=./ttfautohint.css \
--standalone \
pandoc --to=json \
--smart \
ttfautohint.txt \
| ./handle-images ".pdf" \
| TEXINPUTS=".;" \
pandoc --from=json \
--latex-engine=pdflatex \
--template=./template.tex \
--variable="version:0.94" \
--number-sections \
--toc \
--chapters \
--standalone \
pandoc: Error producing PDF from TeX source.
! LaTeX Error: File `libertine.sty' not found.

Type X to quit or <RETURN> to proceed,
or enter new name. (Default extension: sty)

Enter file name:
! Emergency stop.
<read *>

l.10 ^^M

make[2]: *** [ttfautohint.pdf] Error 43
make[2]: Leaving directory `/home/csaba/pkg/packer/packerbuild-1000/ttfautohint/ttfautohint/src/ttfautohint-0.94/doc'
make[1]: *** [all-recursive] Error 1
make[1]: Leaving directory `/home/csaba/pkg/packer/packerbuild-1000/ttfautohint/ttfautohint/src/ttfautohint-0.9
make: *** [all] Error 2