Warning: file_exists(): open_basedir restriction in effect. File(/srv/http/vhosts/aur.archlinux.org/public/web/locale//en/LC_MESSAGES/aurweb.mo) is not within the allowed path(s): (/srv/http/vhosts/aur-dev.archlinux.org/:/etc/aurweb/) in /srv/http/vhosts/aur-dev.archlinux.org/public/web/lib/streams.php on line 90
AUR (en) - timeshift

Notice: Undefined variable: name in /srv/http/vhosts/aur-dev.archlinux.org/public/web/lib/pkgfuncs.inc.php on line 248

Package Details: timeshift 17.2-1

Git Clone URL: https://aur-dev.archlinux.org/timeshift.git (read-only)
Package Base: timeshift
Description: A system restore utility for Linux
Upstream URL: https://code.launchpad.net/~teejee2008/timeshift
Licenses: GPL
Submitter: severach
Maintainer: severach
Last Packager: severach
Votes: 14
Popularity: 1.989735
First Submitted: 2015-08-19 07:22
Last Updated: 2017-01-29 03:37

Latest Comments

1 2 Next › Last »

crowja commented on 2017-01-29 01:30

seems invalid sha256sum for timeshift_v17.2_r429.tgz, works after changing PKGBUILD:


severach commented on 2016-07-14 16:07

Install Debian to a spare machine from the junk box. Install timeshift. If the check box problem is there too then you report to the developer. If not then look for differences between Arch and Debian.

Maxiride commented on 2016-07-14 11:12

@severach do you mean I need to switch linux distro? I don't get it :\

severach commented on 2016-07-07 08:19

Try installing Debian to see if your checkbox issue is fixed.

Maxiride commented on 2016-07-07 07:42

Got a couple of issue, don't know if I should report it to the software releaser or if an issue related to this package.

Settings-> Planned backups: I can only tick the options, clicking again won't untick the option

Always about planned backups I enabled the daily ones but after a week when I reopened timeshift no backups have been done.

Maxiride commented on 2016-06-25 07:23

@severach indeed, thank you very much. Install successful.

severach commented on 2016-06-24 17:13

Building in a clean chroot showed that vte3 is required.

Maxiride commented on 2016-06-24 16:22

Having the same error as @irishwoody plus some missing variable at the end of the compilation:

/tmp/yaourt-tmp-federico/aur-timeshift/src/~teejee2008/timeshift/trunk/src/TerminalWindow.vala.c:30:21: fatal error: vte/vte.h: File o directory non esistente
#include <vte/vte.h>
compilation terminated.
error: cc exited with status 256
Compilation failed: 1 error(s), 15 warning(s)
make[1]: *** [makefile:17: all] Error 1
make: *** [makefile:2: all] Error 2
/usr/bin/makepkg: riga 729: logpipe: variabile non assegnata ==> variable unassigned
==> ERRORE: Makepkg non è riuscito a compilare timeshift.
==> Riavviare la compilazione di timeshift [s/N]
==> --------------------------------------------

irishwoody commented on 2016-06-22 08:44

version 16.3-1 does not seem to build correclty. The following is error message.

==> Retrieving sources...
-> Found timeshift_v16.3_r186.tgz
-> Found sha256sums.txt
==> Validating source files with sha256sums...
timeshift_v16.3_r186.tgz ... Skipped
sha256sums.txt ... Skipped
==> Extracting sources...
-> Extracting timeshift_v16.3_r186.tgz with bsdtar
==> Starting prepare()...
Files sha256sums.txt and sha256sums.test differ
==> ERROR: A failure occurred in prepare().

ottomops commented on 2016-06-22 07:29

Keep getting an error when trying to install the latest version...

==> Beginne prepare()...
Files sha256sums.txt and sha256sums.test differ