Notice: Undefined variable: name in /srv/http/vhosts/ on line 248

Package Details: ted 2.23-7

Git Clone URL: (read-only)
Package Base: ted
Description: Lightweight RTF text processor
Upstream URL:
Licenses: GPL
Submitter: sergej
Maintainer: willemw
Last Packager: willemw
Votes: 9
Popularity: 0.403334
First Submitted: 2012-12-04 12:18
Last Updated: 2016-01-20 08:02

Required by (0)

Sources (25)

Latest Comments

willemw commented on 2016-01-20 08:05

@trialuser: Added lsb-release. For me the build did not fail, it only gave a warning.

trialuser commented on 2016-01-20 04:39

Fails to build for me unless lsb-release is installed.

willemw commented on 2015-10-16 15:33

@blippy: The freetype include patch is not needed anymore. Thanks. Fixed.
The git clone URL is correct. It is for downloading sources, not for viewing sources in a web browser.

blippy commented on 2015-10-16 14:59

I also obtained the fterrdef.h, as reported by anamesa on 2014-02-16. However, I was able to build Ted 2.23 from sources at:

It seems that the prepare() statement, which seds out "freetype" from the include statements, is actually unnecessary, and is causing the problem.

I also notice that points to "Page not found".

haawda commented on 2015-02-15 00:58

I had to add options=('!makeflags') to the PKGBUILD to compile this. Probably it was a race condition on my system, but I wanted to tell anyone.

anamesa commented on 2014-02-21 20:25

@willemw: Now it compiles ok. thanks.

willemw commented on 2014-02-16 14:00

@anamesa: Thanks. Fixed.

anamesa commented on 2014-02-16 08:18

Compilation terminates with following error (archlinux 64bit):

appFontConfig.c: In function ‘appFtErrorStr’:
appFontConfig.c:892:34: fatal error: freetype/fterrdef.h: No such file or directory
# include <freetype/fterrdef.h>
compilation terminated.
<builtin>: recipe for target 'appFontConfig.o' failed
make[1]: *** [appFontConfig.o] Error 1
make[1]: Leaving directory '/tmp/yaourt-tmp-fasma/aur-ted/src/Ted-2.23/appFrame'
Makefile:212: recipe for target 'lib/appFrame.a' failed
make: *** [lib/appFrame.a] Error 2
==> ERROR: A failure occurred in build().
==> ERROR: Makepkg was unable to build ted.
==> Restart building ted ? [y/N]