Notice: Undefined variable: name in /srv/http/vhosts/aur-dev.archlinux.org/public/web/lib/pkgfuncs.inc.php on line 248

Package Details: tango-icon-theme 0.8.90-11

Git Clone URL: https://aur-dev.archlinux.org/tango-icon-theme.git (read-only)
Package Base: tango-icon-theme
Description: Icon theme that follows the Tango visual guidelines
Upstream URL: http://tango.freedesktop.org
Licenses: custom:public domain, custom:TRADEMARKS
Submitter: boenki
Maintainer: boenki
Last Packager: boenki
Votes: 220
Popularity: 1.225505
First Submitted: 2011-12-19 23:52
Last Updated: 2016-12-30 05:40

Latest Comments

« First ‹ Previous 1 2 3 4 5 Next › Last »

Anonymous comment on 2012-04-18 14:06

/usr/lib/pkgconfig/icon-naming-utils.pc is owned by icon-naming-utils 0.8.90-2

It's there but still the configure fails ...

rafaelff commented on 2012-04-18 13:55

@jskywalker: The configure looks for the file "/usr/lib/pkgconfig/icon-naming-utils.pc" provided by package "icon-naming-utils". Confirm that this command works:

pacman -Qo /usr/lib/pkgconfig/icon-naming-utils.pc

Anonymous comment on 2012-04-18 13:40

configure: error: icon-naming-utils >= 0.8.90 is required to build and install tango-icon-theme

But I'm sure icon-naming-utils 0.8.90 is installed :(

rafaelff commented on 2012-01-10 23:41

@boenki: "XML/LibXML/SAX.pm" is provided by package "perl-xml-libxml", which seems to be a dependency in package() function. Having that said, please add "perl-xml-libxml" to makedepends=()

rafaelff commented on 2012-01-10 23:25

@boenki: Do you know what is causing my error and how to fix it?

rafaelff commented on 2012-01-08 23:48

package() is failing to complete. See the last lines of it:



(cd /tmp/yaourt-tmp-rafael/aur-tango-icon-theme/pkg/usr/share/icons/Tango/16x16 && /usr/lib/icon-naming-utils/icon-name-mapping -c actions)
Can't locate XML/LibXML/SAX.pm in @INC (@INC contains: /usr/lib/perl5/site_perl /usr/share/perl5/site_perl /usr/lib/perl5/vendor_perl /usr/share/perl5/vendor_perl /usr/lib/perl5/core_perl /usr/share/perl5/core_perl .) at (eval 3) line 1.
make[3]: *** [install-data-local] Error 2
make[3]: Leaving directory `/tmp/yaourt-tmp-rafael/aur-tango-icon-theme/src/tango-icon-theme-0.8.90/16x16/actions'
make[2]: *** [install-am] Error 2
make[2]: Leaving directory `/tmp/yaourt-tmp-rafael/aur-tango-icon-theme/src/tango-icon-theme-0.8.90/16x16/actions'
make[1]: *** [install-recursive] Error 1
make[1]: Leaving directory `/tmp/yaourt-tmp-rafael/aur-tango-icon-theme/src/tango-icon-theme-0.8.90/16x16'
make: *** [install-recursive] Error 1
==> ERROR: A failure occurred in package().
Aborting...

mrunion commented on 2012-01-06 02:48

I don't know what was "wrong", but I bascially installed/reinstalled perl and every xml and sax package for it from pacman. It now works. Paparently a dependency of a dependency was not there. I suspec one of the perl-xml-sax* packages.

mrunion commented on 2012-01-06 02:36

Same error using makepkg:

/usr/bin/perl: symbol lookup error: /usr/lib/perl5/site_perl/auto/XML/LibXML/LibXML.so: undefined symbol: Perl_Gthr_key_ptr
make[3]: *** [install-data-local] Error 127
make[3]: Leaving directory `/var/abs/local/tango-icon-theme/src/tango-icon-theme-0.8.90/16x16/actions'
make[2]: *** [install-am] Error 2
make[2]: Leaving directory `/var/abs/local/tango-icon-theme/src/tango-icon-theme-0.8.90/16x16/actions'
make[1]: *** [install-recursive] Error 1
make[1]: Leaving directory `/var/abs/local/tango-icon-theme/src/tango-icon-theme-0.8.90/16x16'
make: *** [install-recursive] Error 1

I have no clue whatsoever. It's no big deal, though.

mrunion commented on 2012-01-06 02:29

I will try downloading it and installing it with makepkg when I get a chance. I have the same versions of software as you, but I use x86_64, so not sure if that makes a difference.

Anonymous comment on 2012-01-04 22:19

Sounds almost like an issue with a perl upgrade. Anyway, I just updated it with yaourt 0.10.2-1 and it builds just fine here on i686 with perl 5.14.2-5.
Try downloading the tarball and using makepkg instead, just a thought.