Warning: file_exists(): open_basedir restriction in effect. File(/srv/http/vhosts/aur.archlinux.org/public/web/locale//en/LC_MESSAGES/aurweb.mo) is not within the allowed path(s): (/srv/http/vhosts/aur-dev.archlinux.org/:/etc/aurweb/) in /srv/http/vhosts/aur-dev.archlinux.org/public/web/lib/streams.php on line 90
AUR (en) - synthpod-git

Notice: Undefined variable: name in /srv/http/vhosts/aur-dev.archlinux.org/public/web/lib/pkgfuncs.inc.php on line 248

Package Details: synthpod-git 0.1.1651-1

Git Clone URL: https://aur-dev.archlinux.org/synthpod-git.git (read-only)
Package Base: synthpod-git
Description: Lightweight non-linear plugin host
Upstream URL: http://open-music-kontrollers.ch/lv2/synthpod
Licenses: Artistic2.0
Groups: lv2-plugins, lv2-hosts
Conflicts: synthpod
Provides: synthpod
Submitter: ventosus
Maintainer: ventosus
Last Packager: ventosus
Votes: 0
Popularity: 0.000000
First Submitted: 2015-11-23 20:19
Last Updated: 2016-09-07 07:43

Latest Comments

ventosus commented on 2016-03-31 10:15

Fixed.

You've been most unlucky, trying to compile synthpod-git exactly between the introduction of new dependencies upstream and the needed adjustments to the PKGBUILD ;-)

cmt227 commented on 2016-03-30 20:00

Hi,

When I try to build this package I get an error like this:

Scanning dependencies of target synthpod.alsa
[ 28%] Building CXX object bin/CMakeFiles/synthpod.alsa.dir/pcmi.cpp.o
[ 30%] Building C object bin/CMakeFiles/synthpod.alsa.dir/synthpod_alsa.c.o
[ 32%] Building C object bin/CMakeFiles/synthpod.alsa.dir/synthpod_nsm.c.o
[ 34%] Building C object bin/CMakeFiles/synthpod.alsa.dir/__/symap/symap.c.o
[ 36%] Linking CXX executable synthpod_alsa
../lib/libsynthpod_ui.so.0.1.1: undefined reference to `sandbox_master_fd_get'
../lib/libsynthpod_ui.so.0.1.1: undefined reference to `sandbox_master_flush'
../lib/libsynthpod_ui.so.0.1.1: undefined reference to `sandbox_master_recv'
../lib/libsynthpod_ui.so.0.1.1: undefined reference to `sandbox_master_new'
../lib/libsynthpod_ui.so.0.1.1: undefined reference to `sandbox_master_free'
../lib/libsynthpod_ui.so.0.1.1: undefined reference to `sandbox_master_send'
collect2: error: ld returned 1 exit status
bin/CMakeFiles/synthpod.alsa.dir/build.make:175: recipe for target 'bin/synthpod_alsa' failed
make[2]: *** [bin/synthpod_alsa] Error 1
CMakeFiles/Makefile2:260: recipe for target 'bin/CMakeFiles/synthpod.alsa.dir/all' failed
make[1]: *** [bin/CMakeFiles/synthpod.alsa.dir/all] Error 2
Makefile:149: recipe for target 'all' failed
make: *** [all] Error 2
==> ERROR: A failure occurred in build().
Aborting...

I believe I have all the correct dependencies installed. Thanks for any help you can provide.

-Carsten