Warning: file_exists(): open_basedir restriction in effect. File(/srv/http/vhosts/aur.archlinux.org/public/web/locale//en/LC_MESSAGES/aurweb.mo) is not within the allowed path(s): (/srv/http/vhosts/aur-dev.archlinux.org/:/etc/aurweb/) in /srv/http/vhosts/aur-dev.archlinux.org/public/web/lib/streams.php on line 90
AUR (en) - supercollider-with-plugins

Notice: Undefined variable: name in /srv/http/vhosts/aur-dev.archlinux.org/public/web/lib/pkgfuncs.inc.php on line 248

Package Details: supercollider-with-plugins 3.8.0-2

Git Clone URL: https://aur-dev.archlinux.org/supercollider-with-plugins.git (read-only)
Package Base: supercollider-with-plugins
Description: An environment and programming language for real time audio synthesis and algorithmic composition. Current version including sc3-plugins.
Upstream URL: http://supercollider.github.io/
Licenses: GPL3
Conflicts: sc3-plugins-git, supercollider
Provides: supercollider
Submitter: ChaosKid42
Maintainer: ChaosKid42
Last Packager: ChaosKid42
Votes: 4
Popularity: 0.661871
First Submitted: 2016-06-19 15:50
Last Updated: 2017-01-08 20:31

Latest Comments

ChaosKid42 commented on 2017-01-08 20:40

"-fext-numeric-literals" used to be necessary to compile.

Removed it, as it's not necessary with gcc 6.2.

smoge commented on 2017-01-08 14:32

Why `-fext-numeric-literals`?

beatboxchad commented on 2016-10-23 03:56

There seem to be some missing qt5 dependencies. I am currently installing after aborting an install of AUR/supercollider-git which has whatever's missing from this, but I'll do a repro on my Linode later and tell you which ones. The build was failing until I did that.

ChaosKid42 commented on 2016-09-01 08:01

@dmnc:
@Thraex:
The errors you reported are fixed now. Thanks for reporting.

dmnc commented on 2016-08-31 11:52

==> Validating source files with md5sums...
SuperCollider-3.7.2-Source-linux.tar.bz2 ... Passed
Version-3.7.2.tar.gz ... Passed
4.5.1.tar.gz ... FAILED

Thraex commented on 2016-07-13 13:30

I have tried several times to install from your packaging and it always fails. The last one messaged this:
make[2]: *** [lang/CMakeFiles/libsclang.dir/build.make:331: lang/CMakeFiles/libsclang.dir/LangPrimSource/PyrMathPrim.cpp.o] Error 1
make[1]: *** [CMakeFiles/Makefile2:3673: lang/CMakeFiles/libsclang.dir/all] Error 2
make: *** [Makefile:161: all] Error 2
==> ERROR: A failure occurred in build().
Aborting...