Warning: file_exists(): open_basedir restriction in effect. File(/srv/http/vhosts/aur.archlinux.org/public/web/locale//en/LC_MESSAGES/aurweb.mo) is not within the allowed path(s): (/srv/http/vhosts/aur-dev.archlinux.org/:/etc/aurweb/) in /srv/http/vhosts/aur-dev.archlinux.org/public/web/lib/streams.php on line 90
AUR (en) - spectator-git

Notice: Undefined variable: name in /srv/http/vhosts/aur-dev.archlinux.org/public/web/lib/pkgfuncs.inc.php on line 248

Package Details: spectator-git v0.6.r45.gbe39a5b-1

Git Clone URL: https://aur-dev.archlinux.org/spectator-git.git (read-only)
Package Base: spectator-git
Description: Desktop application to monitor router Turris
Upstream URL: https://gitlab.labs.nic.cz/turris/spectator
Licenses: GPL3
Submitter: Pixx
Maintainer: Pixx
Last Packager: Pixx
Votes: 0
Popularity: 0.000000
First Submitted: 2016-03-06 21:03
Last Updated: 2016-03-06 22:18

Latest Comments

vladacr commented on 2016-10-14 07:47

Trying to install but at the end I get this error:

In file included from src/main.cpp:19:0:
src/application.h:63:6: error: ‘int SpectatorApplication::exec()’ marked ‘override’, but does not override
int exec() Q_DECL_OVERRIDE;
^~~~
make[1]: *** [Makefile:879: build/main.o] Chyba 1
make[1]: Opouští se adresář „/tmp/yaourt-tmp-vlad/aur-spectator-git/src/spectator-git/gui“
make: *** [Makefile:69: sub-gui-make_first] Chyba 2
==> CHYBA: Došlo k chybě v build().
Rušení...
==> ERROR: Makepkg was unable to build spectator-git.