Warning: file_exists(): open_basedir restriction in effect. File(/srv/http/vhosts/aur.archlinux.org/public/web/locale//en/LC_MESSAGES/aurweb.mo) is not within the allowed path(s): (/srv/http/vhosts/aur-dev.archlinux.org/:/etc/aurweb/) in /srv/http/vhosts/aur-dev.archlinux.org/public/web/lib/streams.php on line 90
AUR (en) - sdformat

Notice: Undefined variable: name in /srv/http/vhosts/aur-dev.archlinux.org/public/web/lib/pkgfuncs.inc.php on line 248

Package Details: sdformat 4.1.0-1

Git Clone URL: https://aur-dev.archlinux.org/sdformat.git (read-only)
Package Base: sdformat
Description: SDF Converter for gazebo
Upstream URL: http://sdformat.org/
Licenses: Apache
Submitter: bchretien
Maintainer: bchretien (v01d)
Last Packager: bchretien
Votes: 6
Popularity: 0.276032
First Submitted: 2014-06-18 23:24
Last Updated: 2016-04-28 21:11

Latest Comments

1 2 Next › Last »

zorun commented on 2017-02-03 17:13

bchretien: can you react one way or the other? Are you still willing to maintain this package? If not, you should orphan it.

nakano commented on 2016-12-20 10:20

Yeah, it's a pitty that it's flagged out-of-data for 4 weeks, especially since a proper PKGBUILD file already exists for the 4.2 version

sdformat 4.2: https://gist.github.com/justbuchanan/deb12082994047308bc1e99db959efba

testb commented on 2016-11-29 18:47

Flagged out-of-date for 4 weeks :(

joaocandre commented on 2016-11-03 11:38

Getting undefined references to boost.

(...)
-- Generating done
-- Build files have been written to: /home/joao/.cache/pacaur/sdformat/src/sdformat-4.1.0/build
==> Removing existing $pkgdir/ directory...
==> Starting build()...
[ 1%] Built target gtest
[ 2%] Built target gtest_main
[ 13%] Built target sdformat
[ 13%] Linking CXX executable INTEGRATION_nested_model
../../src/libsdformat.so.4.1.0: undefined reference to `boost::re_detail_106000::cpp_regex_traits_implementation<char>::transform[abi:cxx11](char const*, char const*) const'
../../src/libsdformat.so.4.1.0: undefined reference to `boost::re_detail_106000::get_default_error_string(boost::regex_constants::error_type)'
../../src/libsdformat.so.4.1.0: undefined reference to `boost::re_detail_106000::perl_matcher<__gnu_cxx::__normal_iterator<char const*, std::__cxx11::basic_string<char, std::char_traits<char>, std::allocator<char> > >, std::allocator<boost::sub_match<__gnu_cxx::__normal_iterator<char const*, std::__cxx11::basic_string<char, std::char_traits<char>, std::allocator<char> > > > >, boost::regex_traits<char, boost::cpp_regex_traits<char> > >::construct_init(boost::basic_regex<char, boost::regex_traits<char, boost::cpp_regex_traits<char> > > const&, boost::regex_constants::_match_flags)'
../../src/libsdformat.so.4.1.0: undefined reference to `boost::re_detail_106000::get_mem_block()'
../../src/libsdformat.so.4.1.0: undefined reference to `boost::re_detail_106000::raise_runtime_error(std::runtime_error const&)'
../../src/libsdformat.so.4.1.0: undefined reference to `boost::re_detail_106000::put_mem_block(void*)'
../../src/libsdformat.so.4.1.0: undefined reference to `boost::re_detail_106000::verify_options(unsigned int, boost::regex_constants::_match_flags)'
../../src/libsdformat.so.4.1.0: undefined reference to `boost::re_detail_106000::cpp_regex_traits_implementation<char>::transform_primary[abi:cxx11](char const*, char const*) const'
collect2: error: ld returned 1 exit status
make[2]: *** [test/integration/CMakeFiles/INTEGRATION_nested_model.dir/build.make:103: test/integration/INTEGRATION_nested_model] Error 1
make[1]: *** [CMakeFiles/Makefile2:255: test/integration/CMakeFiles/INTEGRATION_nested_model.dir/all] Error 2
make: *** [Makefile:139: all] Error 2
==> ERROR: A failure occurred in build().
Aborting...
:: failed to build sdformat package(s)

jbuchanan30 commented on 2016-11-02 05:21

I modified this for sdformat v4.2.0 and posted it here: https://gist.github.com/justbuchanan/deb12082994047308bc1e99db959efba

bchretien commented on 2015-03-12 16:44

@topquarkred: now that makes more sense ^^ PKGBUILD updated, thanks ;-)

topquarkred commented on 2015-03-12 16:42

Ahh.. Sorry, I meant ruby...

bchretien commented on 2015-03-12 16:39

@topquarkred: hmm could not find anything clear related to perl. Which error did you get? However apparently Ruby is required.

topquarkred commented on 2015-03-12 16:31

This package requires perl to build. Builds fine after manually installing perl.

bchretien commented on 2015-01-21 21:27

@m01: it seems to be an error in the generated pkg-config file:

libdir=${prefix}//usr/lib

This is fixed by using the relative path.