Warning: file_exists(): open_basedir restriction in effect. File(/srv/http/vhosts/aur.archlinux.org/public/web/locale//en/LC_MESSAGES/aurweb.mo) is not within the allowed path(s): (/srv/http/vhosts/aur-dev.archlinux.org/:/etc/aurweb/) in /srv/http/vhosts/aur-dev.archlinux.org/public/web/lib/streams.php on line 90
AUR (en) - scangearmp-mg6200

Notice: Undefined variable: name in /srv/http/vhosts/aur-dev.archlinux.org/public/web/lib/pkgfuncs.inc.php on line 248

Package Details: scangearmp-mg6200 1.80-3

Git Clone URL: https://aur-dev.archlinux.org/scangearmp-mg6200.git (read-only)
Package Base: scangearmp-mg6200
Description: Canon Scanner Driver (for mg6200 series)
Upstream URL: http://support-au.canon.com.au/contents/AU/EN/0100393102.html
Licenses: custom
Submitter: Lopo
Maintainer: Lopo
Last Packager: Lopo
Votes: 2
Popularity: 0.000000
First Submitted: 2012-03-20 13:33
Last Updated: 2015-12-16 12:21

Latest Comments

Anonymous comment on 2013-09-20 18:03

To resolve my build problem I copied libcncpnet.so and libcncpmsui.so to /usr/lib (from the libs_bin64 dir) then everything built ok. Then I had to remove the files copied to /usr/lib to be able to install the built package, everything works now.

Anonymous comment on 2013-09-17 18:48

I get the following when trying to execute makepkg:

/usr/bin/ld: cannot find -lcncpnet
collect2: error: ld returned 1 exit status
make[1]: *** [libsane-canon_mfp.la] Error 1
make[1]: Leaving directory `/home/<user>/Downloads/scangearmp-mg6200/src/scangearmp-source-1.80-1/scangearmp/backend'
make: *** [all-recursive] Error 1
==> ERROR: A failure occurred in build().

Any help is really appreciated!