Notice: Undefined variable: name in /srv/http/vhosts/aur-dev.archlinux.org/public/web/lib/pkgfuncs.inc.php on line 248

Package Details: sagemath-git 7.6.beta2.r0.g375d4ee776-1

Git Clone URL: https://aur-dev.archlinux.org/sagemath-git.git (read-only)
Package Base: sagemath-git
Description: Open Source Mathematics Software, free alternative to Magma, Maple, Mathematica, and Matlab
Upstream URL: http://www.sagemath.org
Licenses: GPL
Conflicts: sage-mathematics, sagemath
Provides: sage-mathematics, sagemath
Replaces: sage-mathematics
Submitter: arojas
Maintainer: arojas
Last Packager: arojas
Votes: 2
Popularity: 0.000005
First Submitted: 2015-04-16 17:55
Last Updated: 2017-02-02 22:52

Dependencies (82)

Required by (5)

Sources (13)

Latest Comments

1 2 3 4 5 6 ... Next › Last »

tsallinia86 commented on 2016-11-20 16:37

Works perfectly on my lenovo g50 laptop.

Daedalus24 commented on 2016-03-24 19:10

Current status:

==> Starting prepare()...
patching file src/sage/misc/package.py
Hunk #1 succeeded at 222 (offset 18 lines).
patching file src/bin/sage-env
Hunk #2 FAILED at 211.
Hunk #3 succeeded at 284 (offset 9 lines).
Hunk #4 FAILED at 326.
Hunk #5 succeeded at 407 with fuzz 1 (offset 17 lines).
Hunk #6 succeeded at 572 (offset 13 lines).
2 out of 6 hunks FAILED -- saving rejects to file src/bin/sage-env.rej

arojas commented on 2016-02-21 23:13

my bad, fixed for real now

Daedalus24 commented on 2016-02-21 18:41

Extracting pynac-0.6.1.tar.gz with bsdtar
==> Removing existing $pkgdir/ directory...
==> Starting build()...
/home/.../abs/community/pynac/PKGBUILD: line 20: ./configure: No such file or directory

Daedalus24 commented on 2016-02-20 11:48

Thank you @arojas, much obliged. I'll wait for abs to update, it's not done yet

arojas commented on 2016-02-20 10:57

@Daedalus24 thanks, fixed in abs

Daedalus24 commented on 2016-02-20 08:45

pynac-0.6.1 returns a compile error, either from abs or from builds directory

CXX libpynac_la-numeric.lo
numeric.cpp: In function ‘std::ostream& GiNaC::operator<<(std::ostream&, const GiNaC::numeric&)’:
numeric.cpp:312:54: error: ‘PyObject_REPR’ was not declared in this scope
os << PyObject_REPR(o);
^
numeric.cpp: In constructor ‘GiNaC::numeric::numeric(PyObject*, bool)’:
numeric.cpp:488:62: error: ‘PyInt_AS_LONG’ was not declared in this scope
mpz_set_si(v._bigint, PyInt_AS_LONG(o));
^
Makefile:764: recipe for target 'libpynac_la-numeric.lo' failed
make[2]: *** [libpynac_la-numeric.lo] Error 1

arojas commented on 2016-02-10 21:37

Thanks, should be fixed in meataxe 2.4.24-3. You'll also need to update to pynac 0.6.1

Daedalus24 commented on 2016-02-10 12:11

there is one more problem

[214/443] gcc -DNDEBUG -march=x86-64 -mtune=generic -O2 -pipe -fstack-protector-strong -march=x86-64 -mtune=generic -O2 -pipe -fstack-protector-strong -D_FORTIFY_SOURCE=2 -fPIC -I/usr/include/sage -I/usr/include/python2.7 -I/usr/lib/python2.7/site-packages/numpy/core/include -I/tmp/yaourt-tmp-unicornis65/aur-sagemath-git/src/sage/src -I/tmp/yaourt-tmp-unicornis65/aur-sagemath-git/src/sage/src/sage/ext -I/tmp/yaourt-tmp-unicornis65/aur-sagemath-git/src/sage/src/build/cythonized -I/tmp/yaourt-tmp-unicornis65/aur-sagemath-git/src/sage/src/build/cythonized/sage/ext -I/usr/include/python2.7 -c /tmp/yaourt-tmp-unicornis65/aur-sagemath-git/src/sage/src/build/cythonized/sage/matrix/matrix_gfpn_dense.c -o build/temp.linux-x86_64-2.7/tmp/yaourt-tmp-unicornis65/aur-sagemath-git/src/sage/src/build/cythonized/sage/matrix/matrix_gfpn_dense.o -fno-strict-aliasing -w
gcc -pthread -shared -Wl,-O1,--sort-common,--as-needed,-z,relro -Wl,-O1,--sort-common,--as-needed,-z,relro -march=x86-64 -mtune=generic -O2 -pipe -fstack-protector-strong -D_FORTIFY_SOURCE=2 build/temp.linux-x86_64-2.7/tmp/yaourt-tmp-unicornis65/aur-sagemath-git/src/sage/src/build/cythonized/sage/matrix/matrix_gfpn_dense.o -L/usr/lib -L/usr/lib -lmtx -lpython2.7 -o build/lib.linux-x86_64-2.7/sage/matrix/matrix_gfpn_dense.so
/usr/bin/ld: /usr/lib/libmtx.a(args.o): relocation R_X86_64_32 against `.rodata' can not be used when making a shared object; recompile with -fPIC
/usr/lib/libmtx.a: error adding symbols: Bad value
collect2: error: ld returned 1 exit status

arojas commented on 2016-02-09 22:19

patch is fixed now, thanks. Note that you'll need to update pari-sage once again to build successfully.