Notice: Undefined variable: name in /srv/http/vhosts/ on line 248

Package Details: retroshare-git 0.6.1.r426.g31b1583-1

Git Clone URL: (read-only)
Package Base: retroshare-git
Description: Serverless encrypted instant messenger with filesharing, chatgroups, e-mail.
Upstream URL:
Keywords: i2p retroshare tor
Licenses: GPL, LGPL
Conflicts: retroshare
Provides: retroshare
Submitter: sehraf
Maintainer: sehraf
Last Packager: sehraf
Votes: 18
Popularity: 0.072547
First Submitted: 2015-08-04 08:22
Last Updated: 2016-12-15 09:38

Latest Comments

1 2 3 4 5 6 Next › Last »

dtschmitz commented on 2019-05-04 21:51


Please add CMake to retroshare's dependencies. Thanks! DTS

sehraf commented on 2016-12-18 21:34

seems ok for me - how long does it take to crash?

Please report thing like that directly to RetroShare

As long as the crash is not caused by the way how the packet is built i can't do anything.

Athaba commented on 2016-12-17 19:28

It appears that the latest Qt update causes crahes, even after recompiling.

dtschmitz commented on 2016-03-29 20:22


Thank you so much for your suggestion.

Coincidentally, another committer @Zener has just had his PR merged with precisely the changes you recommend.

So I will rerun the PKGBUILD and hope for the best.
Will confirm the PR resolves this issue shortly.

dtschmitz commented on 2016-03-29 20:18


It looks like Cyril just merged a PR for @Zener which fixes up a C++11 constexpr for precisely the same errors I experienced here:

So, I will test -- don't think there's anything for you to fix. -- Dietrich

Fanch commented on 2016-03-29 20:17

In fact it have been fixed in the git repo, so you don't need my temp fix anymore

Fanch commented on 2016-03-29 19:38

@dtschmitz :

please open PKGBUILD, in build() function, line 68, include :

find . -name "*.h" -exec sed -i.bak -e s/'const float'/'constexpr float'/g {} \;
find . -name "*.h" -exec sed -i.bak -e s/'const double'/'constexpr double'/g {} \;

It should compile again :)

dtschmitz commented on 2016-03-29 12:28

Follow up comment to @sehraf:

As always thank you for all your hard work.


I have configured ~/.config/qtchooser as:

And I have installed qt5 along with Qt-creator open source.

Still have the qt4 PKGBUILD so I am fine for now. It builds normally. Get to when you can.

Kindest Regards,

dtschmitz commented on 2016-03-29 12:23

In file included from ./pqi/pqiperson.h:48:0, from ./pqi/pqipersongrp.h:31, from ./rsserver/p3face.h:35, from dbase/ ./pqi/pqiqosstreamer.h:37:55: error: ‘constexpr’ needed for in-class initialization of static data member ‘const float pqiQoSstreamer::PQI_QOS_STREAMER_ALPHA’ of non-integral type [-fpermissive] static const float PQI_QOS_STREAMER_ALPHA = 2.0 ; ^ In file included from dbase/ ./rsserver/p3face.h:197:40: error: ‘constexpr’ needed for in-class initialization of static data member ‘const double RsServer::minTimeDelta’ of non-integral type [-fpermissive] static const double minTimeDelta = 0.1; // 25; ^ ./rsserver/p3face.h:198:40: error: ‘constexpr’ needed for in-class initialization of static data member ‘const double RsServer::maxTimeDelta’ of non-integral type [-fpermissive] static const double maxTimeDelta = 0.5; ^ ./rsserver/p3face.h:199:37: error: ‘constexpr’ needed for in-class initialization of static data member ‘const double RsServer::kickLimit’ of non-integral type [-fpermissive] static const double kickLimit = 0.15; ^ Makefile.libretroshare:1644: recipe for target 'temp/linux-g++/obj/fimonitor.o' failed make[1]: *** [temp/linux-g++/obj/fimonitor.o] Error 1 make[1]: Leaving directory '/home/dts/retroshare-git/src/retroshare/libretroshare/src' Makefile:99: recipe for target 'sub-libretroshare-src-libretroshare-pro-make_first' failed make: *** [sub-libretroshare-src-libretroshare-pro-make_first] Error 2 ==> ERROR: A failure occurred in build(). Aborting... [dts@ThinkPad-vm retroshare-git]$

Please review and advise. -- Dietrich

sehraf commented on 2015-08-27 15:57

I've updated the package to rely on 'make install'.
Notable differences:
- binaries are now 'RetroShare06' and 'RetroShare06-nogui'
- option to (not) build nogui was removed

Pls report any problems (in case there are any)