Warning: file_exists(): open_basedir restriction in effect. File(/srv/http/vhosts/aur.archlinux.org/public/web/locale//en/LC_MESSAGES/aurweb.mo) is not within the allowed path(s): (/srv/http/vhosts/aur-dev.archlinux.org/:/etc/aurweb/) in /srv/http/vhosts/aur-dev.archlinux.org/public/web/lib/streams.php on line 90
AUR (en) - qwtpolar

Notice: Undefined variable: name in /srv/http/vhosts/aur-dev.archlinux.org/public/web/lib/pkgfuncs.inc.php on line 248

Package Details: qwtpolar 1.1.1-1

Git Clone URL: https://aur-dev.archlinux.org/qwtpolar.git (read-only)
Package Base: qwtpolar
Description: Qwt library that contains classes for displaying values on a polar coordinate system
Upstream URL: http://qwtpolar.sourceforge.net/
Licenses: custom:qwt
Submitter: felixzero
Maintainer: Scimmia
Last Packager: Scimmia
Votes: 52
Popularity: 1.387909
First Submitted: 2011-05-21 13:54
Last Updated: 2016-01-15 03:31

Latest Comments

« First ‹ Previous 1 2 3 Next › Last »

saultdon commented on 2015-07-26 08:44

@oxalin

I thought about adding -svn to the pkgname, but please see the first line for the guidelines at: https://wiki.archlinux.org/index.php/VCS_package_guidelines#Guidelines

saultdon commented on 2015-07-26 08:40

@dbr,oxalin

Sorry, but I can't reproduce those errors. It builds fine for myself... I'll have a look though.

dbr commented on 2015-07-25 09:34

I'm actually trying to install qgis which depends on qwtpolar and am running into problems because the sourceforge svn repos are offline.

Below I document my (somewhat hokey) partial success with a fail at the last hurdle.

1. Download qwtpolar-1.1.1.zip from http://sourceforge.net/projects/qwtpolar/

2. Following instructions from INSTALL: qmake - ran with no output, assume that is successful

3. make - got following error:

qwt_polar_fitter.h:13:30: fatal error: qwt_curve_fitter.h: No such file or directory

4. Following advice here and output of `whereis qwt`, I added the includepath to qwtpolarbuild.pri

`linux-g++ {
# CONFIG += separate_debug_info
INCLUDEPATH += /usr/include/qwt
}`

5. re-run make - now it at least gets further with compiling but now I get this error:

`collect2: error: ld returned 1 exit status
Makefile:228: recipe for target '../bin/spectrogram' failed
make[2]: *** [../bin/spectrogram] Error 1
make[2]: Leaving directory '/home/dbr/builds/qwtpolar-1.1.1/examples/spectrogram'
Makefile:43: recipe for target 'sub-spectrogram-make_first' failed
make[1]: *** [sub-spectrogram-make_first] Error 2
make[1]: Leaving directory '/home/dbr/builds/qwtpolar-1.1.1/examples'
Makefile:130: recipe for target 'sub-examples-make_first-ordered' failed
make: *** [sub-examples-make_first-ordered] Error 2
make 26.70s user 1.81s system 87% cpu 32.425 total`

6. I decided to comment out the examples by editing the line in qwtpolarconfig.pri
#QWT_POLAR_CONFIG += QwtPolarExamples

7. re-run make - don't get any errors

8. Looking at https://aur.archlinux.org/packages/qw/qwtpolar/PKGBUILD, I ran the sequence of sed commands to alter qwtpolarconfig.pri and qwtpolarbuild.pri

sed -i -e 's/$${QWT_POLAR_INSTALL_PREFIX}\/doc/\/usr\/share\/doc\/qwt\//' qwtpolarconfig.pri
sed -i -e 's/$${QWT_POLAR_INSTALL_PREFIX}\/include/\/usr\/include\/qwt\//' qwtpolarconfig.pri
sed -i -e 's/$${QWT_POLAR_INSTALL_PREFIX}\/lib/\/usr\/lib\//' qwtpolarconfig.pri
sed -i -e 's/$${QWT_POLAR_INSTALL_PREFIX}\/features/\/usr\/share\/qwt\/features\//' qwtpolarconfig.pri
sed -i -e 's/^.*QwtPolarDesigner//' qwtpolarconfig.pri
sed -i -e 's/^.*QwtPolarExamples//' qwtpolarconfig.pri
echo "INCLUDEPATH += /usr/include" >> qwtpolarbuild.pri

I notice that this takes out the 'examples' line I did in step 6 - maybe should have done this first ;)

9. make install - no errors, but when I ask 'whereis qwtpolar', I
get 'qwtpolar:' which I take to mean that it isn't installed or
has gone to the wrong place and this hunch is confirmed by
performing `yainstall qgis` which lists 'qwtpolar' as a
dependency it has to install and this is the problem.

oxalin commented on 2015-07-20 18:58

Ok, after testing the installation, I think the problem in the lines identified in the previous comment comes from the "qwt" in the three following lines:
sed -i -e 's/$${QWT_POLAR_INSTALL_PREFIX}\/doc/\/usr\/share\/doc\/qwt\//' qwtpolarconfig.pri
sed -i -e 's/$${QWT_POLAR_INSTALL_PREFIX}\/include/\/usr\/include\/qwt\//' qwtpolarconfig.pri
[...]
sed -i -e 's/$${QWT_POLAR_INSTALL_PREFIX}\/features/\/usr\/share\/qwt\/features\//' qwtpolarconfig.pri


They should use "qwtpolar" instead:
sed -i -e 's/$${QWT_POLAR_INSTALL_PREFIX}\/doc/\/usr\/share\/doc\/qwtpolar\//' qwtpolarconfig.pri
sed -i -e 's/$${QWT_POLAR_INSTALL_PREFIX}\/include/\/usr\/include\/qwtpolar\//' qwtpolarconfig.pri
[...]
sed -i -e 's/$${QWT_POLAR_INSTALL_PREFIX}\/features/\/usr\/share\/qwtpolar\/features\//' qwtpolarconfig.pri

oxalin commented on 2015-07-20 18:10

I had some problem building the package because of the following:
sed -i -e 's/$${QWT_POLAR_INSTALL_PREFIX}\/doc/\/usr\/share\/doc\/qwt\//' qwtpolarconfig.pri
sed -i -e 's/$${QWT_POLAR_INSTALL_PREFIX}\/include/\/usr\/include\/qwt\//' qwtpolarconfig.pri
sed -i -e 's/$${QWT_POLAR_INSTALL_PREFIX}\/lib/\/usr\/lib\//' qwtpolarconfig.pri
sed -i -e 's/$${QWT_POLAR_INSTALL_PREFIX}\/features/\/usr\/share\/qwt\/features\//' qwtpolarconfig.pri
sed -i -e 's/^.*QwtPolarDesigner//' qwtpolarconfig.pri
sed -i -e 's/^.*QwtPolarExamples//' qwtpolarconfig.pri
echo "INCLUDEPATH += /usr/include" >> qwtpolarbuild.pri

It was adding files to the package that were already installed by other packages, that is files from qwt in particular. Removing these lines from the PKGBUILD fixed the problem and I could complete the build correctly and install it. Either something is included that shouldn't or there is a clean up missing in the package() function.

oxalin commented on 2015-07-20 15:20

If I may suggest, since this is a stable branch, you should rename the package to something similar to the following: qwtpolar-1.1-svn. Then, modify your description so it is clear that you are always in sync with the 1.1 branch.

That will be easier for users to identify the latest qwtpolar from 1.1 branch VS the latest SVN branch.

saultdon commented on 2015-05-02 19:55

@Wuzzy This actually builds qwtpolar from SVN which for this package is a stable release branch. I use it because there are usually back ported patches available.

So when you build it will be 1.1.x where x is the latest release like 1,2,3 etc...
The r182 is the revision number of the latest commit.

Wuzzy commented on 2015-05-02 16:30

I just (seemingly) installed qwtpolar 1.1-5, I immediately checked with yaourt, it reported that I have 1.1.r182-1 instead. :-(

sh4wn commented on 2014-09-19 13:11

When trying to install using Aura, I get an error that the subversion url does not exists.

saultdon commented on 2014-03-08 17:22

Upgraded to 1.1.0, pulling from svn which includes bugs/fixes but it's still the 'release' version.