Warning: file_exists(): open_basedir restriction in effect. File(/srv/http/vhosts/aur.archlinux.org/public/web/locale//en/LC_MESSAGES/aurweb.mo) is not within the allowed path(s): (/srv/http/vhosts/aur-dev.archlinux.org/:/etc/aurweb/) in /srv/http/vhosts/aur-dev.archlinux.org/public/web/lib/streams.php on line 90
AUR (en) - qtmobility

Notice: Undefined variable: name in /srv/http/vhosts/aur-dev.archlinux.org/public/web/lib/pkgfuncs.inc.php on line 248

Package Details: qtmobility 1.2.0-9

Git Clone URL: https://aur-dev.archlinux.org/qtmobility.git (read-only)
Package Base: qtmobility
Description: A cross-platform application and UI framework
Upstream URL: https://qt.gitorious.org/qt-mobility
Licenses: GPL3, LGPL2.1
Submitter: daimonion
Maintainer: None
Last Packager: ImNtReal
Votes: 56
Popularity: 0.000011
First Submitted: 2012-03-13 14:06
Last Updated: 2015-06-08 13:28

Latest Comments

1 2 3 Next › Last »

noogar commented on 2017-01-26 07:36

Upstream URL does not work, please fix

dreieck commented on 2017-01-02 18:47

.. also, building all supported modules also works for me (by not specifying a list, according to ./configure --help. The PKGBUILD would build all except of one modules.)

dreieck commented on 2017-01-02 18:21

Compilation error:


qvideosurfacegstsink.cpp:335:1: error: narrowing conversion of ‘4278190080u’ from ‘unsigned int’ to ‘int’ inside { } [-Wnarrowing]


Workaround-patch: http://ix.io/1OYf

Works for me, at least.

ImNtReal commented on 2015-04-02 19:33

@Vladimiroff, you should be able to build it, now. Hopefully, you don't need the connectivity module.

ImNtReal commented on 2015-04-02 18:20

It looks like newer versions require Qt5Contacts, which I can't seem to find anywhere. I'll work to see if I can get the older version patched to build against current qt4.

ImNtReal commented on 2015-04-02 16:45

I'm having the same issue. I'm also having trouble building a newer unreleased version of it. This one may wind up being a big pain to fix.

Vladimiroff commented on 2015-03-31 12:42

I get an error while trying to compile it:

g++ -c -pipe -march=x86-64 -mtune=generic -O2 -pipe -fstack-protector-strong --param=ssp-buffer-size=4 -fvisibility=hidden -fvisibility-inlines-hidden -Wall -W -D_REENTRANT -fPIC -DQT_SHARED -DQTM_PLUGIN_PATH=\"/usr/lib/qt4/plugins\" -DQT_BUILD_CONNECTIVITY_LIB -DQT_MAKEDLL -DQT_NO_DEBUG -DQT_CORE_LIB -I/usr/share/qt4/mkspecs/linux-g++ -I. -I/usr/include/qt4/QtCore -I/usr/include/qt4 -I../global -Infc -Ibluetooth -I.. -I/usr/include/qt4/QtNetwork -I../../build/Release/QtConnectivity/moc -o ../../build/Release/QtConnectivity/qbluetoothlocaldevice.o bluetooth/qbluetoothlocaldevice.cpp
In file included from bluetooth/qbluetoothlocaldevice.cpp:43:0:
bluetooth/qbluetoothlocaldevice_p.h:56:24: fatal error: QDBusContext: No such file or directory
#include <QDBusContext>
compilation terminated.
Makefile:570: recipe for target '../../build/Release/QtConnectivity/qbluetoothlocaldevice.o' failed
make[2]: *** [../../build/Release/QtConnectivity/qbluetoothlocaldevice.o] Error 1
make[2]: Leaving directory '/tmp/yaourt-tmp-kiril/aur-qtmobility/src/qt-mobility-opensource-src-1.2.0/src/connectivity'
Makefile:340: recipe for target 'sub-connectivity-make_default' failed
make[1]: *** [sub-connectivity-make_default] Error 2
make[1]: Leaving directory '/tmp/yaourt-tmp-kiril/aur-qtmobility/src/qt-mobility-opensource-src-1.2.0/src'
Makefile:43: recipe for target 'sub-src-make_default-ordered' failed
make: *** [sub-src-make_default-ordered] Error 2
==> ERROR: A failure occurred in build().
==> ERROR: Makepkg was unable to build qtmobility.

sl1pkn07 commented on 2013-10-19 13:22

pkgbuild with new version and patch from ROSA project



sl1pkn07 commented on 2013-10-18 21:06

i lack gstreamer . BTW, i'm no use it

the new homepage is http://qt.digia.com/Product/Qt-Add-Ons/Mobility/


sl1pkn07 commented on 2013-10-18 20:47

pkgbuild with new version and patch from ROSA project