Warning: file_exists(): open_basedir restriction in effect. File(/srv/http/vhosts/aur.archlinux.org/public/web/locale//en/LC_MESSAGES/aurweb.mo) is not within the allowed path(s): (/srv/http/vhosts/aur-dev.archlinux.org/:/etc/aurweb/) in /srv/http/vhosts/aur-dev.archlinux.org/public/web/lib/streams.php on line 90
AUR (en) - psi-plus-git

Notice: Undefined variable: name in /srv/http/vhosts/aur-dev.archlinux.org/public/web/lib/pkgfuncs.inc.php on line 248

Package Details: psi-plus-git 0.16.559.574-1

Git Clone URL: https://aur-dev.archlinux.org/psi-plus-git.git (read-only)
Package Base: psi-plus-git
Description: Psi+ is a powerful Jabber client (Qt, C++) designed for the Jabber power users
Upstream URL: http://psi-plus.com
Licenses: GPL2
Conflicts: psi-plus, psi-plus-webkit-git
Provides: psi-plus=0.16.559.574
Replaces: psi-plus, psi-plus-webkit-git
Submitter: TZ86
Maintainer: TZ86
Last Packager: TZ86
Votes: 133
Popularity: 0.066916
First Submitted: 2013-08-06 17:06
Last Updated: 2016-05-27 12:31

Dependencies (9)

Required by (4)

Sources (4)

Latest Comments

1 2 3 4 5 6 ... Next › Last »

chris_muc commented on 2016-11-07 09:33

issue with building:
libpsi/tools/zip/zip.cpp:128:82: error: cannot convert ‘UnZip::CaseSensitivity’ to ‘unzFileNameComparer {aka int (*)(void*, const char*, const char*)}’ for argument ‘3’ to ‘int unzLocateFile(unzFile, const char*, unzFileNameComparer)’
err = unzLocateFile(d->uf, QFile::encodeName(fname).data(), d->caseSensitive);
make[1]: *** [Makefile:4862: .obj/zip.o] Error 1
make[1]: Leaving directory '/tmp/yaourt-tmp-chris/aur-psi-plus-git/src/psi/src'
make: *** [Makefile:62: sub-src-make_default] Error 2
==> ERROR: A failure occurred in build().
==> ERROR: Makepkg was unable to build psi-plus-git.

any tips how to resolve it?


TZ86 commented on 2016-10-17 06:34

Just wait a bit until psi-plus developers updates their patches.

gay commented on 2016-10-16 20:52

Similar issue; build with makepkg fails while attempting to patch chatview_te

Pastebin: http://pastebin.com/YyQnHEFh

The rejects are:
for chatview_te.cpp: http://pastebin.com/vzSEV2Zs
for chatview_te.h: http://pastebin.com/sTH2UmQX

EDIT 2016-10-17:
Thanks, this is indeed what happened. The package builds cleanly again now.

TZ86 commented on 2016-10-14 18:42

It fails because it tries to apply patches to already patched sources. If that log isn't from two different command then yaourt copies sources, successfully applies all patches, updates pkgver and... starts everything from a beginning (starting from depends checks).

kamiljk87 commented on 2016-10-14 14:17

Yea done that too looks like it have a problem with patches apply, maybe exist ones/duplicate etc...

TZ86 commented on 2016-10-14 10:53

Remove any /tmp/yaourt-tmp-* then try once more.

kamiljk87 commented on 2016-10-13 17:37


TZ86 commented on 2016-10-13 07:20

Save a whole build log to pastebin.com and post a link there.

kamiljk87 commented on 2016-10-13 03:13

Not build anymore... If possible please also change qconf-git to qconf from Community...

cousinm commented on 2016-05-27 14:11

Found my problem:


already reported by an archlinux, it seems…