Notice: Undefined variable: name in /srv/http/vhosts/aur-dev.archlinux.org/public/web/lib/pkgfuncs.inc.php on line 248

Package Details: polybar 3.0.3-1

Git Clone URL: https://aur-dev.archlinux.org/polybar.git (read-only)
Package Base: polybar
Description: A fast and easy-to-use status bar
Upstream URL: https://github.com/jaagr/polybar
Keywords: bar bspwm i3 lemonbar lemonbuddy polybar
Licenses: MIT
Conflicts: polybar-git
Submitter: jaagr
Maintainer: jaagr
Last Packager: jaagr
Votes: 21
Popularity: 5.992715
First Submitted: 2016-11-19 05:09
Last Updated: 2017-01-27 14:56

Dependencies (17)

Required by (0)

Sources (1)

Latest Comments

1 2 Next › Last »

taylorthurlow commented on 2017-01-08 21:51

Failing to compile for me on two different machines, opened a bug report on the Github page: https://github.com/jaagr/polybar/issues/310

EDIT: Looks like this is due to outdated `freetype2` that comes bundled with `infinality`. Package maintainer is AWOL I guess and hasn't updated it and it's finally starting to break stuff. More info and workaround(s) here:

https://www.reddit.com/r/archlinux/comments/5mphpu/psa_harfbuzz_update_infinality_breaking_system/

flick36 commented on 2017-01-07 00:04

@jobu did you resolve your issue? iḿ facing the same problem

Solved by removing Infinality fonts with: 'pacman -S --asdeps freetype2 cairo fontconfig'

jaagr commented on 2017-01-01 08:22

@eolien: the difference is that `polybar` is referencing a release tag while `polybar-git` pulls the latest HEAD.

eolien commented on 2016-12-27 17:00

what's the difference between polybar and polybar-git ?
polybar pull from github too...

markand commented on 2016-12-26 10:48

Maybe we should add -DCMAKE_BUILD_TYPE=Release to the cmake options?

jobu commented on 2016-12-25 22:13

I cannot update (and I don't understand if the problem is a conflict with freetype2):


[ 83%] Building CXX object bin/CMakeFiles/polybar.dir/x11/extensions/xkb.cpp.o
[ 84%] Building CXX object bin/CMakeFiles/polybar.dir/x11/fonts.cpp.o
In file included from /usr/include/freetype2/freetype/config/ftconfig.h:42:0,
from /usr/include/freetype2/freetype/freetype.h:33,
from /home/francesco/.cache/pacaur/polybar/src/polybar/include/x11/fonts.hpp:4,
from /home/francesco/.cache/pacaur/polybar/src/polybar/src/x11/fonts.cpp:10:
/usr/include/freetype2/freetype/config/ftoption.h:679:0: error: "TT_CONFIG_OPTION_SUBPIXEL_HINTING" redefined
#define TT_CONFIG_OPTION_SUBPIXEL_HINTING ( 1 | 2 )

/usr/include/freetype2/freetype/config/ftoption.h:678:0: note: this is the location of the previous definition
#define TT_CONFIG_OPTION_SUBPIXEL_HINTING 1

make[2]: *** [bin/CMakeFiles/polybar.dir/build.make:1671: bin/CMakeFiles/polybar.dir/x11/fonts.cpp.o] Error 1
make[1]: *** [CMakeFiles/Makefile2:334: bin/CMakeFiles/polybar.dir/all] Error 2
make: *** [Makefile:128: all] Error 2
==> ERRORE: Si è verificato un errore in build().
L'operazione sta per essere interrotta...
:: failed to build polybar package(s)

Thank you if you can help

jaagr commented on 2016-11-03 18:03

@edgard, @mrmackie: Should be fixed now.

And if you want mpd support you need to install libmpdclient (listed as an optional dependency)

edgard commented on 2016-11-03 16:32

same error as @mrmackie

mrmackie commented on 2016-11-03 16:09

Does not build successfully for me since last update.

Full build log as a gist: https://gist.github.com/mrmurb/5baa7f79e14f68cf151a915fb44ad6a0

harbinger commented on 2016-11-01 14:38

@jaagr Ah, that did it. Thanks!