Warning: file_exists(): open_basedir restriction in effect. File(/srv/http/vhosts/aur.archlinux.org/public/web/locale//en/LC_MESSAGES/aurweb.mo) is not within the allowed path(s): (/srv/http/vhosts/aur-dev.archlinux.org/:/etc/aurweb/) in /srv/http/vhosts/aur-dev.archlinux.org/public/web/lib/streams.php on line 90
AUR (en) - pjproject

Notice: Undefined variable: name in /srv/http/vhosts/aur-dev.archlinux.org/public/web/lib/pkgfuncs.inc.php on line 248

Package Details: pjproject 2.6-1

Git Clone URL: https://aur-dev.archlinux.org/pjproject.git (read-only)
Package Base: pjproject
Description: Open source SIP stack and media stack
Upstream URL: http://www.pjsip.org/
Licenses: GPL
Submitter: None
Maintainer: xdevla
Last Packager: xdevla
Votes: 21
Popularity: 0.150020
First Submitted: 2007-09-07 12:14
Last Updated: 2017-01-26 15:08

Latest Comments

1 2 Next › Last »

joximus commented on 2017-01-30 12:31

build failed on my cubieboard:
../../webrtc/src/webrtc//modules/audio_processing/aec/aec_core_sse2.c:15:23: fatal error: emmintrin.h: No such file or directory
#include <emmintrin.h>
^
compilation terminated.
make[3]: *** [/home/alarm/build/pjproject/src/pjproject-2.6/build/rules.mak:163: output/libwebrtc-armv7l-unknown-linux-gnueabihf/modules/audio_processing/aec/aec_core_sse2.o] Error 1
make[3]: Leaving directory '/home/alarm/build/pjproject/src/pjproject-2.6/third_party/build/webrtc'
make[2]: *** [Makefile:89: libwebrtc-armv7l-unknown-linux-gnueabihf.a] Error 2
make[2]: Leaving directory '/home/alarm/build/pjproject/src/pjproject-2.6/third_party/build/webrtc'
make[1]: *** [Makefile:7: all] Error 1
make[1]: Leaving directory '/home/alarm/build/pjproject/src/pjproject-2.6/third_party/build'
make: *** [Makefile:14: all] Error 1
==> ERROR: A failure occurred in build().
Aborting...

reinhardd commented on 2016-11-06 10:19

Theres a bug with version 2.5.5 that made asterisk crash when using endpoints configured through pjsip.conf: https://trac.pjsip.org/repos/ticket/1946

Already fixed upstream but no release so far.
https://trac.pjsip.org/repos/changeset?format=diff&new=5373&old=5401&new_path=%2Fpjproject%2Ftrunk%2Fpjsip%2Fsrc%2Fpjsip%2Fsip_dialog.c&old_path=%2Fpjproject%2Ftrunk%2Fpjsip%2Fsrc%2Fpjsip%2Fsip_dialog.c

reinhardd commented on 2016-11-06 08:12

The armv7h build suffers from the same installation issue

PaterSiul commented on 2016-10-30 18:14

If you replaced
"install -D -m755 pjsip-apps/bin/pjsua-*gnu ${pkgdir}/usr/bin/pjsua"
with
"install -D -m755 pjsip-apps/bin/pjsua-`${srcdir}/${pkgname}-${pkgver}/config.guess` ${pkgdir}/usr/bin/pjsua"
that line should work on i686/x86_64 as well as on arm systems.

In that case, you could add armv6h to arch.

das-ich commented on 2016-08-24 08:03

please add arch='armv7h' to PKGBUILD

FixedWing commented on 2016-05-20 21:02

I see that with version 2.5, PJSIP now supports Opus. Any possibility that this could be enabled bby default in PKGBUILD? Thanx.

tuxce commented on 2016-05-09 07:54

To build this on Rpi (armv7l, armv7h), replace this line :

install -D -m755 pjsip-apps/bin/pjsua-*gnu ${pkgdir}/usr/bin/pjsua

by adding * after 'gnu' :

install -D -m755 pjsip-apps/bin/pjsua-*gnu* ${pkgdir}/usr/bin/pjsua

BakaKuna commented on 2015-12-26 15:10

pjsip is now at 2.4.5. Any reason not to use this?

Crazyachmed commented on 2015-04-08 13:45

Build failes on armv6h (Raspi):
install: cannot stat ‘pjsip-apps/bin/pjsua-*gnu’: No such file or directory

xdevla commented on 2014-07-17 09:26

Added, thanks