Warning: file_exists(): open_basedir restriction in effect. File(/srv/http/vhosts/aur.archlinux.org/public/web/locale//en/LC_MESSAGES/aurweb.mo) is not within the allowed path(s): (/srv/http/vhosts/aur-dev.archlinux.org/:/etc/aurweb/) in /srv/http/vhosts/aur-dev.archlinux.org/public/web/lib/streams.php on line 90
AUR (en) - peco

Notice: Undefined variable: name in /srv/http/vhosts/aur-dev.archlinux.org/public/web/lib/pkgfuncs.inc.php on line 248

Package Details: peco 0.4.7-1

Git Clone URL: https://aur-dev.archlinux.org/peco.git (read-only)
Package Base: peco
Description: Simplistic interactive filtering tool
Upstream URL: https://github.com/peco/peco
Licenses: MIT
Submitter: swalladge
Maintainer: swalladge
Last Packager: swalladge
Votes: 6
Popularity: 0.318521
First Submitted: 2015-06-28 22:03
Last Updated: 2016-12-17 07:06

Required by (0)

Sources (1)

Latest Comments

swalladge commented on 2016-11-03 09:31

@j605 I can't reproduce that problem, neither on my machine nor in a clean container. Is your system up-to-date? Have you tried deleting all output files (src/, pkg/) and building from scratch?

Let me know how you go, and if it's still a problem you'll have to provide more information (full error log, whether you can build it following instructions from upstream, whether you can build a previous version of this package).

j605 commented on 2016-11-03 07:59

it doesn't work for me. This is what I get,

[ERROR] Failed to set version on github.com/mattn/go-runewidth to 737072b4e32b7a5018b4a7125da8d12de90e8045: The Remote does not match the VCS endpoint
[ERROR] Failed to set version on github.com/jessevdk/go-flags to 4cc2832a6e6d1d3b815e2b9d544b2a4dfb3ce8fa: The Remote does not match the VCS endpoint
[ERROR] Failed to set version on github.com/google/btree to 925471ac9e2131377a91e1595defec898166fe49: The Remote does not match the VCS endpoint
[ERROR] Failed to set version on github.com/pkg/errors to 839d9e913e063e28dfd0e6c7b7512793e0a48be9: The Remote does not match the VCS endpoint
[ERROR] Failed to set version on github.com/stretchr/testify to 976c720a22c8eb4eb6a0b4348ad85ad12491a506: The Remote does not match the VCS endpoint
[ERROR] Failed to set version on github.com/davecgh/go-spew to 6d212800a42e8ab5c146b8ace3490ee17e5225f9: The Remote does not match the VCS endpoint
[ERROR] Failed to set version on github.com/lestrrat/go-pdebug to 2e6eaaa5717f81bda41d27070d3c966f40a1e75f: The Remote does not match the VCS endpoint
[ERROR] Failed to set version on github.com/nsf/termbox-go to b6acae516ace002cb8105a89024544a1480655a5: The Remote does not match the VCS endpoint
[ERROR] Failed to set version on golang.org/x/net to daba796358cd2742b75aae05761f1b898c9f6a5c: The Remote does not match the VCS endpoint
An Error has occurred
make: *** [Makefile:29: installdeps] Error 2

I think it might be related to https://github.com/Masterminds/glide/issues/612

swalladge commented on 2016-10-20 01:46

... and now back to using the source. This time it correctly uses the downloaded version instead of grabbing the git master.

swalladge commented on 2016-08-23 08:12

Package now uses the pre-built binaries. Please let me know if there are any issues.