Notice: Undefined variable: name in /srv/http/vhosts/ on line 248

Package Details: parmetis 4.0.3.p2-1

Git Clone URL: (read-only)
Package Base: parmetis
Description: A parallel graph partitioning library
Upstream URL:
Licenses: custom
Submitter: jedbrown
Maintainer: jedbrown
Last Packager: jedbrown
Votes: 22
Popularity: 0.033367
First Submitted: 2008-05-15 20:41
Last Updated: 2016-02-11 01:02

Latest Comments

1 2 3 4 Next › Last »

jedbrown commented on 2016-02-11 01:04

That's a new build requirement, but doesn't affect the package. Fixed without incrementing pkgrel because anyone that has already built it doesn't benefit from a reinstall.

Calucinho commented on 2016-02-11 00:51

@jedbrown, there is a small syntax error in PKGBUILD which makes the build fail. The license should be inside an array. To fix change




paugre commented on 2015-10-19 19:22

Great, thanks :)

jedbrown commented on 2015-10-19 19:03

Please reinstall metis. The current version is 5.1.0.p1-2, and includes the gklib headers.

paugre commented on 2015-10-19 18:18

OK, so I'm running into the same issue... risking to look stupid, but where can I get those gklib headers from?

Calucinho commented on 2015-09-01 01:20

I am having the same problem as noctlos. I did, however, managed to install parmetis by using a different source and removing the "p-thingy" in the version numbering in the PKGBUILD:


alen12345 commented on 2015-08-27 13:16

Sorry for marking as out of date. Please remove the flag and this comment.

eleftg commented on 2015-08-12 14:37

Sorry for the late reply but I'm on holidays... I'm disowning the package so that jedbrown can keep up maintaining it, just like he did before the AUR4 transition

jedbrown commented on 2015-08-11 15:20

@noctlos The new metis maintainer stopped installing gklib headers. I commented there and hopefully it will be resolved with an update to metis. In the meantime, you could use the previous version of metis.

noctlos commented on 2015-08-11 13:26

Fails to build:

In file included from /tmp/yaourt-tmp-phandy/aur-parmetis/src/parmetis-4.0.3-p1/headers/GKlib.h:66:0,
from /tmp/yaourt-tmp-phandy/aur-parmetis/src/parmetis-4.0.3-p1/libparmetis/./parmetislib.h:19,
from /tmp/yaourt-tmp-phandy/aur-parmetis/src/parmetis-4.0.3-p1/libparmetis/xyzpart.c:15:
/tmp/yaourt-tmp-phandy/aur-parmetis/src/parmetis-4.0.3-p1/headers/gk_externs.h:20:23: fatal error: gklib_tls.h: No such file or directory
compilation terminated.
libparmetis/CMakeFiles/parmetis.dir/build.make:57: recipe for target 'libparmetis/CMakeFiles/parmetis.dir/xyzpart.c.o' failed
make[3]: *** [libparmetis/CMakeFiles/parmetis.dir/xyzpart.c.o] Error 1
make[3]: Leaving directory '/tmp/yaourt-tmp-phandy/aur-parmetis/src/parmetis-4.0.3-p1/build/Linux-x86_64'
CMakeFiles/Makefile2:93: recipe for target 'libparmetis/CMakeFiles/parmetis.dir/all' failed
make[2]: *** [libparmetis/CMakeFiles/parmetis.dir/all] Error 2
make[2]: Leaving directory '/tmp/yaourt-tmp-phandy/aur-parmetis/src/parmetis-4.0.3-p1/build/Linux-x86_64'
Makefile:119: recipe for target 'all' failed
make[1]: *** [all] Error 2
make[1]: Leaving directory '/tmp/yaourt-tmp-phandy/aur-parmetis/src/parmetis-4.0.3-p1/build/Linux-x86_64'
Makefile:71: recipe for target 'all' failed
make: *** [all] Error 2
==> ERROR: A failure occurred in build().

Fix? Help?