Warning: file_exists(): open_basedir restriction in effect. File(/srv/http/vhosts/aur.archlinux.org/public/web/locale//en/LC_MESSAGES/aurweb.mo) is not within the allowed path(s): (/srv/http/vhosts/aur-dev.archlinux.org/:/etc/aurweb/) in /srv/http/vhosts/aur-dev.archlinux.org/public/web/lib/streams.php on line 90
AUR (en) - paraview

Notice: Undefined variable: name in /srv/http/vhosts/aur-dev.archlinux.org/public/web/lib/pkgfuncs.inc.php on line 248

Package Details: paraview 5.2.0-2

Git Clone URL: https://aur-dev.archlinux.org/paraview.git (read-only)
Package Base: paraview
Description: Parallel Visualization Application using VTK
Upstream URL: http://www.paraview.org
Licenses: custom
Submitter: stephane
Maintainer: deezy (eolianoe)
Last Packager: eolianoe
Votes: 60
Popularity: 1.074439
First Submitted: 2012-12-11 01:37
Last Updated: 2016-12-02 14:42

Latest Comments

« First ‹ Previous 1 2 3 4 5 6 7 8 9 10 11 ... Next › Last »

sachkris commented on 2015-01-26 04:02

Paraview v4.3.1 is out now

haraldkl commented on 2014-12-22 15:26

Sorry, the new package is actually https://geb.sts.nt.uni-siegen.de/paraview-4.2.0-3.src.tar.gz

haraldkl commented on 2014-12-22 13:03

I never got an internal compiler error. In which file does this happen?

However, with gcc 4.9.2-1 I am now getting type mismatches and a failed build. I used the following patch to get rid of it:

--- a/VTK/Rendering/FreeType/vtkFreeTypeTools.cxx 2014-09-23 16:47:11.000000000 +0200
+++ b/VTK/Rendering/FreeType/vtkFreeTypeTools.cxx 2014-12-22 11:04:14.003492645 +0100
@@ -1183,7 +1183,7 @@
if (bitmap)
{
metaData.ascent = std::max(bitmapGlyph->top - 1, metaData.ascent);
- metaData.descent = std::min(-(bitmap->rows - (bitmapGlyph->top - 1)),
+ metaData.descent = std::min(-int((bitmap->rows - (bitmapGlyph->top - 1))),
metaData.descent);
}
++heightString;
@@ -1950,8 +1950,8 @@
if (bitmap)
{
bbox[0] = std::min(bbox[0], pen[0] + bitmapGlyph->left);
- bbox[1] = std::max(bbox[1], pen[0] + bitmapGlyph->left + bitmap->width);
- bbox[2] = std::min(bbox[2], pen[1] + bitmapGlyph->top - 1 - bitmap->rows);
+ bbox[1] = std::max(bbox[1], int(pen[0] + bitmapGlyph->left + bitmap->width));
+ bbox[2] = std::min(bbox[2], int(pen[1] + bitmapGlyph->top - 1 - bitmap->rows));
bbox[3] = std::max(bbox[3], pen[1] + bitmapGlyph->top - 1);
}
else

Most likely the simple casting here, is not the proper way to solve this, but I am not sure what the best solution would be.

I uploaded a package with this patch at https://geb.sts.nt.uni-siegen.de/paraview-4.2.0-2.src.tar.gz

dcanelhas commented on 2014-11-06 17:03

I'm getting "internal compiler error: Segmentation fault"
(even when using haraldkl's patched version).

with
gcc 4.9.1-2
openmpi 1.8.3-1

haraldkl commented on 2014-10-16 07:45

The patch still seems to work, though its off by some lines here and there. My build succeeded now, and I put the source package with the patch from Debian for GCC 4.9 that is working for me at: https://geb.sts.nt.uni-siegen.de/paraview-4.2.0-2.src.tar.gz

haraldkl commented on 2014-10-15 23:53

Yes, the error resulted in an aborted compilation, the complete makepkg output would be somewhat long. It still happens with 4.2, and the solution is patching the sources, such that GCC 4.9 is satisfied. I used the patch from the debian-science-commits list, posted before and got it working with that.

Kitpaddel commented on 2014-09-26 13:23

I get the same error as haraldkl. Was there a solution to this problem?

Full error:

Linking CXX shared library ../../../lib/libvtkFiltersParallelMPI-pv4.2.so
CMakeFiles/vtkFiltersParallelMPI.dir/vtkDistributedDataFilter.cxx.o: In function `vtkDistributedDataFilter::AddConstantUnsignedCharPointArray(vtkUnstructuredGrid*, char const*, unsigned char)':
vtkDistributedDataFilter.cxx:(.text+0x288b): warning: memset used with constant zero length parameter; this could be due to transposed parameters
collect2: Fehler: ld gab 1 als Ende-Status zurück
VTK/Filters/ParallelMPI/CMakeFiles/vtkFiltersParallelMPI.dir/build.make:232: recipe for target 'lib/libvtkFiltersParallelMPI-pv4.2.so.1' failed
make[2]: *** [lib/libvtkFiltersParallelMPI-pv4.2.so.1] Error 1
CMakeFiles/Makefile2:8675: recipe for target 'VTK/Filters/ParallelMPI/CMakeFiles/vtkFiltersParallelMPI.dir/all' failed
make[1]: *** [VTK/Filters/ParallelMPI/CMakeFiles/vtkFiltersParallelMPI.dir/all] Error 2
Makefile:137: recipe for target 'all' failed
make: *** [all] Error 2

matse commented on 2014-09-18 16:45

gdon:
There is no owner and no status to this point on the table and I couldn't find a cmake option that enables me to compile it against system vtk libs - so no, at least for now :)

gdon commented on 2014-09-18 14:29

It seems it is now possible to use arch VTK precompiled libs with Paraview:

http://www.paraview.org/ParaView/index.php/ParaView_4.2_Deliverables

(last item in the table)

Would it be possible to update accordingly?

matse commented on 2014-09-16 17:55

haraldkl:
Does the compilation process abort or are it just warnings like these? And if compilation fails, could you please provide the full output of the makepkg process?