Warning: file_exists(): open_basedir restriction in effect. File(/srv/http/vhosts/aur.archlinux.org/public/web/locale//en/LC_MESSAGES/aurweb.mo) is not within the allowed path(s): (/srv/http/vhosts/aur-dev.archlinux.org/:/etc/aurweb/) in /srv/http/vhosts/aur-dev.archlinux.org/public/web/lib/streams.php on line 90
AUR (en) - paraview

Notice: Undefined variable: name in /srv/http/vhosts/aur-dev.archlinux.org/public/web/lib/pkgfuncs.inc.php on line 248

Package Details: paraview 5.2.0-2

Git Clone URL: https://aur-dev.archlinux.org/paraview.git (read-only)
Package Base: paraview
Description: Parallel Visualization Application using VTK
Upstream URL: http://www.paraview.org
Licenses: custom
Submitter: stephane
Maintainer: deezy (eolianoe)
Last Packager: eolianoe
Votes: 60
Popularity: 1.074439
First Submitted: 2012-12-11 01:37
Last Updated: 2016-12-02 14:42

Latest Comments

« First ‹ Previous 1 2 3 4 5 6 7 8 9 ... Next › Last »

MartinDiehl commented on 2016-04-11 20:06

Using the hdf5-fortran-openmpi package, I get an error (see below) when opening XDMF files (which are opening an HDF5 files). I'm not really sure if this would need to be fixed by the paraview developers or in the Arch package, so please feel free to delete this hint if it's inappropriate.


Warning! ***HDF5 library version mismatched error***
The HDF5 header files used to compile this application do not match
the version used by the HDF5 library to which this application is linked.
Data corruption or segmentation faults may occur if the application continues.
This can happen when an application was compiled by one version of HDF5 but
linked with a different version of static or shared HDF5 library.
You should recompile the application or check your shared library related
settings such as 'LD_LIBRARY_PATH'.
'HDF5_DISABLE_VERSION_CHECK' environment variable is set to 1, application will
continue at your own risk.
Headers are 1.8.15, library is 1.8.16

eolianoe commented on 2016-03-08 08:39

Paraview can also be build against ffmpeg 3.0 using the patch from this bugreport [1]

If you want the export into pdf (or other vector format) remove the line `-DVTK_RENDERING_BACKEND:STRING=OpenGL2` (see mailing-list discussion [2])

[1] http://www.vtk.org/Bug/view.php?id=16001
[2] http://markmail.org/thread/uotu4q7fbrd2jfph

heczis commented on 2016-03-07 14:07

On x86_64, I get:

...
Scanning dependencies of target vtkIOFFMPEG
[ 12%] Building CXX object VTK/IO/FFMPEG/CMakeFiles/vtkIOFFMPEG.dir/vtkFFMPEGWriter.cxx.o
/home/jan/SOFT/paraview/src/ParaView-v5.0.0-source/VTK/IO/FFMPEG/vtkFFMPEGWriter.cxx: In member function ‘int vtkFFMPEGWriterInternal::Start()’:
/home/jan/SOFT/paraview/src/ParaView-v5.0.0-source/VTK/IO/FFMPEG/vtkFFMPEGWriter.cxx:194:18: error: ‘PIX_FMT_YUVJ422P’ was not declared in this scope
c->pix_fmt = PIX_FMT_YUVJ422P;
^
/home/jan/SOFT/paraview/src/ParaView-v5.0.0-source/VTK/IO/FFMPEG/vtkFFMPEGWriter.cxx:198:18: error: ‘PIX_FMT_BGR24’ was not declared in this scope
c->pix_fmt = PIX_FMT_BGR24;
^
/home/jan/SOFT/paraview/src/ParaView-v5.0.0-source/VTK/IO/FFMPEG/vtkFFMPEGWriter.cxx:277:40: error: ‘avcodec_alloc_frame’ was not declared in this scope
this->rgbInput = avcodec_alloc_frame();
^
/home/jan/SOFT/paraview/src/ParaView-v5.0.0-source/VTK/IO/FFMPEG/vtkFFMPEGWriter.cxx:283:36: error: ‘PIX_FMT_RGB24’ was not declared in this scope
int RGBsize = avpicture_get_size(PIX_FMT_RGB24, c->width, c->height);
^
/home/jan/SOFT/paraview/src/ParaView-v5.0.0-source/VTK/IO/FFMPEG/vtkFFMPEGWriter.cxx: In member function ‘int vtkFFMPEGWriterInternal::Write(vtkImageData*)’:
/home/jan/SOFT/paraview/src/ParaView-v5.0.0-source/VTK/IO/FFMPEG/vtkFFMPEGWriter.cxx:357:28: error: ‘PIX_FMT_RGB24’ was not declared in this scope
cc->width, cc->height, PIX_FMT_RGB24,
^
/home/jan/SOFT/paraview/src/ParaView-v5.0.0-source/VTK/IO/FFMPEG/vtkFFMPEGWriter.cxx: In member function ‘int vtkFFMPEGWriterInternal::Start()’:
/home/jan/SOFT/paraview/src/ParaView-v5.0.0-source/VTK/IO/FFMPEG/vtkFFMPEGWriter.cxx:326:53: warning: ignoring return value of ‘int avformat_write_header(AVFormatContext*, AVDictionary**)’, declared with attribute warn_unused_result [-Wunused-result]
avformat_write_header(this->avFormatContext, NULL);
^
VTK/IO/FFMPEG/CMakeFiles/vtkIOFFMPEG.dir/build.make:71: recipe for target 'VTK/IO/FFMPEG/CMakeFiles/vtkIOFFMPEG.dir/vtkFFMPEGWriter.cxx.o' failed
make[2]: *** [VTK/IO/FFMPEG/CMakeFiles/vtkIOFFMPEG.dir/vtkFFMPEGWriter.cxx.o] Error 1
CMakeFiles/Makefile2:7158: recipe for target 'VTK/IO/FFMPEG/CMakeFiles/vtkIOFFMPEG.dir/all' failed
make[1]: *** [VTK/IO/FFMPEG/CMakeFiles/vtkIOFFMPEG.dir/all] Error 2
Makefile:149: recipe for target 'all' failed
make: *** [all] Error 2
==> ERROR: A failure occurred in build().
Aborting...

capitalaslash commented on 2016-02-23 11:55

bug 14215 has finally been solved in vtk 7.0, the dependency should change to ffmpeg.
(actually, using ffmpeg-0.10 does not work, since headers are now stored in a different directory).

mbeaudoin commented on 2015-12-06 13:35

Would it be possible to enable the installation of the ParaView development files by adding the following compile option in PKGBUILD:

-DPARAVIEW_INSTALL_DEVELOPMENT_FILES:BOOL=ON

This would, for instance, facilitate the development of ParaView/Catalyst modules under Arch Linux.

Many thanks in advance.

mbeaudoin commented on 2015-12-06 13:27

@eleftg and @sachkris:

About the comment posted on 2015-03-05 06:19

I am getting the same compilation error on a 32-bit Arch Linux system.
A bug report was logged on the ParaView bug tracker
http://www.paraview.org/Bug/view.php?id=15865

The fix is simple, just a simple type cast at line 765 for the file
VisItBridge/databases/paraDIS/paraDIS_lib/paradis.C

We should have:
vector<Arm*> armpair(2,(Arm*)NULL);

instead of:
vector<Arm*> armpair(2,NULL);

Until this gets fixed in ParaView, a patch file would be necessary.

eolianoe commented on 2015-10-02 09:30

In case someone is interested I uploaded a Qt5 version of ParaView [1], feel free to test it.
[1] https://aur.archlinux.org/packages/paraview-qt5/

sachkris commented on 2015-09-04 11:08

@eleftg and @alen12345
Sorry, I should have posted this earlier.

The compile error reported before was coming in the system where Arch linux was 32bit (i686). I am able to compile without any errors in x86_64.

alen12345 commented on 2015-08-26 21:25

@sachkris: I'm having the same problem, exactly the same compile error. @eleftg: I'm installing the package without modifications, therefore using the aur patch.

Can anyone please help me and @sachkris?

eleftg commented on 2015-04-12 23:46

@echo.motd

(
you can have a log of the entire build process by typing:
makepkg 2>&1 | tee build.log
)

Can you please verify that during the configuration phase the following two lines show up?

-- Check for working CXX compiler: /usr/bin/mpicxx
-- Check for working CXX compiler: /usr/bin/mpicxx -- works