Warning: file_exists(): open_basedir restriction in effect. File(/srv/http/vhosts/aur.archlinux.org/public/web/locale//en/LC_MESSAGES/aurweb.mo) is not within the allowed path(s): (/srv/http/vhosts/aur-dev.archlinux.org/:/etc/aurweb/) in /srv/http/vhosts/aur-dev.archlinux.org/public/web/lib/streams.php on line 90
AUR (en) - paraview

Notice: Undefined variable: name in /srv/http/vhosts/aur-dev.archlinux.org/public/web/lib/pkgfuncs.inc.php on line 248

Package Details: paraview 5.2.0-2

Git Clone URL: https://aur-dev.archlinux.org/paraview.git (read-only)
Package Base: paraview
Description: Parallel Visualization Application using VTK
Upstream URL: http://www.paraview.org
Licenses: custom
Submitter: stephane
Maintainer: deezy (eolianoe)
Last Packager: eolianoe
Votes: 60
Popularity: 1.074439
First Submitted: 2012-12-11 01:37
Last Updated: 2016-12-02 14:42

Latest Comments

« First ‹ Previous 1 2 3 4 5 6 7 8 ... Next › Last »

deezy commented on 2016-06-02 14:57

hdf5 (1.8.x) is included in the paraview source and is used as long hdf5-1.10.x (in Extra) and paraview/vtk are not really compatible.
With the next release, the new Extra package hdf5_18 may be used. But I have to test this first.
So at the moment there is no missing dependency.

hiaselhans commented on 2016-06-02 13:17

missing dependency: hdf5

lahwaacz commented on 2016-05-09 17:10

I'm not getting the 8th line: https://aur.archlinux.org/cgit/aur.git/tree/paraview-desktop.patch?h=paraview#n8

deezy commented on 2016-05-09 16:03

@lahwaacz @juliohm
Added the Exec key to the desktop file. Should work now.

lahwaacz commented on 2016-05-09 15:34

See the specification: https://specifications.freedesktop.org/desktop-entry-spec/desktop-entry-spec-latest.html#recognized-keys

"The Exec key is required if DBusActivatable is not set to true."

So the paraview.desktop does not comply to the standard.

juliohm commented on 2016-05-09 14:59

Everything is perfect, except the desktop file created under /usr/share/applications/paraview.desktop. When I try to open paraview from the Gnome menu it is not found with the message "Desktop file didn't specify Exec field". What is the exact difference between Exec and TryExec? Why to opt for the latter?

wilmbas commented on 2016-05-07 09:43

Build fails with recent version 6 of GCC. I am newbie in pushing updated .SRCINFO and modified PKGBUILD's. But patch and sha1sum is created and added to it. Since I failed to push it please find the patch concatenated to this comment. (Luckily, since I missed to have correct path strings towards VTK/CMake in my patch...newbie behaviour, sorry!)

Have fun, nice weekend. Regards wilmbas

--- VTK/CMake/GenerateExportHeader.cmake 2016-05-07 10:22:52.463297686 +0200
+++ VTK/CMake/GenerateExportHeader.cmake.new 2016-05-07 10:20:26.030649703 +0200
@@ -166,7 +166,7 @@
execute_process(COMMAND ${CMAKE_C_COMPILER} ARGS --version
OUTPUT_VARIABLE _gcc_version_info
ERROR_VARIABLE _gcc_version_info)
- string(REGEX MATCH "[345]\\.[0-9]\\.[0-9]*"
+ string(REGEX MATCH "[3-9]\\.[0-9]\\.[0-9]*"
_gcc_version "${_gcc_version_info}")
# gcc on mac just reports: "gcc (GCC) 3.3 20030304 ..." without the
# patch level, handle this here:
--- VTK/CMake/vtkCompilerExtras.cmake 2016-05-07 10:23:05.523533858 +0200
+++ VTK/CMake/vtkCompilerExtras.cmake.new 2016-05-07 10:22:03.425744259 +0200
@@ -32,7 +32,7 @@
OUTPUT_VARIABLE _gcc_version_info
ERROR_VARIABLE _gcc_version_info)

- string (REGEX MATCH "[345]\\.[0-9]\\.[0-9]*"
+ string (REGEX MATCH "[3-9]\\.[0-9]\\.[0-9]*"
_gcc_version "${_gcc_version_info}")
if(NOT _gcc_version)
string (REGEX REPLACE ".*\\(GCC\\).*([34]\\.[0-9]).*" "\\1.0"

eolianoe commented on 2016-05-04 17:10

The paraview.desktop and paraview.png files can be deleted as the sources already provide those files and they are installed by `make install`.

andrea89g commented on 2016-05-03 12:22

same problem of chuckdaniels, i get these:
In file included from /tmp/yaourt-tmp-andrea/aur-paraview/src/build/VTK/ThirdParty/netcdf/vtknetcdf/config.h:7:0,
from /tmp/yaourt-tmp-andrea/aur-paraview/src/ParaView-v5.0.1-source/VTK/ThirdParty/netcdf/vtknetcdf/libsrc4/nc4internal.c:18:
/tmp/yaourt-tmp-andrea/aur-paraview/src/ParaView-v5.0.1-source/VTK/ThirdParty/netcdf/vtknetcdf/include/vtk_netcdf_mangle.h:229:30: error: conflicting types for ‘vtk_netcdf_nc4_rec_find_nc_type’
#define nc4_rec_find_nc_type vtk_netcdf_nc4_rec_find_nc_type
/tmp/yaourt-tmp-andrea/aur-paraview/src/ParaView-v5.0.1-source/VTK/ThirdParty/netcdf/vtknetcdf/libsrc4/nc4internal.c:383:1: note: in expansion of macro ‘nc4_rec_find_nc_type’
nc4_rec_find_nc_type(NC_GRP_INFO_T *start_grp, nc_type target_nc_typeid)
/tmp/yaourt-tmp-andrea/aur-paraview/src/ParaView-v5.0.1-source/VTK/ThirdParty/netcdf/vtknetcdf/include/vtk_netcdf_mangle.h:229:30: note: previous declaration of ‘vtk_netcdf_nc4_rec_find_nc_type’ was here
#define nc4_rec_find_nc_type vtk_netcdf_nc4_rec_find_nc_type
/tmp/yaourt-tmp-andrea/aur-paraview/src/ParaView-v5.0.1-source/VTK/ThirdParty/netcdf/vtknetcdf/libsrc4/nc4internal.h:370:17: note: in expansion of macro ‘nc4_rec_find_nc_type’
NC_TYPE_INFO_T *nc4_rec_find_nc_type(NC_GRP_INFO_T *start_grp, hid_t target_nc_typeid);
VTK/ThirdParty/netcdf/vtknetcdf/CMakeFiles/vtkNetCDF.dir/build.make:590: recipe for target 'VTK/ThirdParty/netcdf/vtknetcdf/CMakeFiles/vtkNetCDF.dir/libsrc4/nc4internal.c.o' failed
make[2]: *** [VTK/ThirdParty/netcdf/vtknetcdf/CMakeFiles/vtkNetCDF.dir/libsrc4/nc4internal.c.o] Error 1
CMakeFiles/Makefile2:8139: recipe for target 'VTK/ThirdParty/netcdf/vtknetcdf/CMakeFiles/vtkNetCDF.dir/all' failed
make[1]: *** [VTK/ThirdParty/netcdf/vtknetcdf/CMakeFiles/vtkNetCDF.dir/all] Error 2
make[1]: *** Waiting for unfinished jobs....

chuckdaniels commented on 2016-05-03 11:42

Seem that it is not starting with the last hdf5 package update. I cannot recompile the package either.