Warning: file_exists(): open_basedir restriction in effect. File(/srv/http/vhosts/aur.archlinux.org/public/web/locale//en/LC_MESSAGES/aurweb.mo) is not within the allowed path(s): (/srv/http/vhosts/aur-dev.archlinux.org/:/etc/aurweb/) in /srv/http/vhosts/aur-dev.archlinux.org/public/web/lib/streams.php on line 90
AUR (en) - ovmf-git

Notice: Undefined variable: name in /srv/http/vhosts/aur-dev.archlinux.org/public/web/lib/pkgfuncs.inc.php on line 248

Package Details: ovmf-git 18726.edddb94-1

Git Clone URL: https://aur-dev.archlinux.org/ovmf-git.git (read-only)
Package Base: ovmf-git
Description: UEFI Firmware (OVMF) with Secure Boot Support - for Virtual Machines (QEMU) - from Tianocore EDK2 - GIT Version
Upstream URL: https://tianocore.github.io/ovmf/
Keywords: efi tiano tianocore uefi
Licenses: BSD
Conflicts: ovmf, ovmf-bin, ovmf-svn
Provides: ovmf, ovmf-bin, ovmf-svn
Submitter: ridikulusrat
Maintainer: markzz
Last Packager: markzz
Votes: 27
Popularity: 3.689773
First Submitted: 2015-07-22 00:06
Last Updated: 2016-10-02 16:31

Dependencies (4)

Required by (3)

Sources (2)

Latest Comments

1 2 3 4 5 6 ... Next › Last »

zhangyoufu commented on 2016-10-04 11:38

The --enable-flash parameter seems to control the way build.sh invokes QEMU, and is useless for OVMF building.

zhangyoufu commented on 2016-10-04 10:58

What about using TOOL_CHAIN_TAG = GCC5 instead of "Fix GCC Warning as error"?

smbullet commented on 2016-10-01 19:49

This PKGBUILD should work for the meantime: http://pastebin.com/X5uwJPi5

markzz commented on 2016-10-01 18:20

Flag it out of date if the PKGBUILD is out of date. Also there's *nothing* preventing you from updating the script yourself in the meantime.

z3ntu commented on 2016-10-01 17:31

patch: **** Can't open patch file /aur/packages/ovmf-git/src/edk2/CryptoPkg/Library/OpensslLib/EDKII_openssl-1.0.2h.patch : No such file or directory

@markzz !

dullin commented on 2016-09-30 05:30

There's a new version of openssl-1.0.2j and the files for 1.0.2h are now missing.

We need to update the version and SHA1 in the PKGBUILD to fix it.

hydranix commented on 2016-08-24 06:20

I believe the problems building may be caused by community/hardening-wrapper

Removing the hardening-wrapper package fixed many build issues in AUR packages for me, including this one.

Need confirmation though.

markzz commented on 2016-07-30 03:28

lucasheringer: Some people have issues building this on some configurations. I'm not sure what's causing these, but try building the package in a clean chroot. You can find information on how to do this on the wiki.

newsboost commented on 2016-07-30 03:25

Hi lucasheringer,

I can say that this seemed to work very well, at my location: "packer -S ovmf-git". It finished up with "==> Finished making: ovmf-git 19546.92e9b9f-1 (Sat Jul 30 05:22:06 CEST 2016)". Not sure what you've done wrong, though... Assume you have everything updated...

lucasheringer commented on 2016-07-25 19:14

Not building for me:

/usr/bin/ld: GnuGenBootSector.o: relocation R_X86_64_32 against `.rodata' can not be used when making a shared object; recompile with -fPIC
GnuGenBootSector.o: error adding symbols: Bad value
collect2: error: ld returned 1 exit status
make[2]: *** [../Makefiles/app.makefile:24: ../bin/GnuGenBootSector] Error 1
make[2]: Leaving directory '/tmp/yaourt-tmp-lucas/aur-ovmf-git/src/edk2/BaseTools/Source/C/GnuGenBootSector'
make[1]: *** [GNUmakefile:79: GnuGenBootSector] Error 2
make[1]: Leaving directory '/tmp/yaourt-tmp-lucas/aur-ovmf-git/src/edk2/BaseTools/Source/C'
make: *** [GNUmakefile:25: Source/C] Error 2
make: Leaving directory '/tmp/yaourt-tmp-lucas/aur-ovmf-git/src/edk2/BaseTools'