Notice: Undefined variable: name in /srv/http/vhosts/ on line 248

Package Details: openscad-git 20150518-1

Git Clone URL: (read-only)
Package Base: openscad-git
Description: The programmers solid 3D CAD modeller
Upstream URL:
Licenses: GPL2
Conflicts: openscad
Provides: openscad
Submitter: None
Maintainer: keenerd
Last Packager: keenerd
Votes: 10
Popularity: 0.090766
First Submitted: 2011-02-25 03:29
Last Updated: 2015-06-13 04:41

Latest Comments

1 2 3 Next › Last »

heczis commented on 2017-01-10 09:05

In build, I get stuff like this:[_ZN5boost16re_detail_10610012perl_matcherIN9__gnu_cxx17__normal_iteratorIPKcNSt7__cxx1112basic_stringIcSt11char_traitsIcESaIcEEEEESaINS_9sub_matchISC_EEENS_12regex_traitsIcNS_16cpp_regex_traitsIcEEEEE12extend_stackEv]+0x18): undefined reference to `boost::re_detail_106100::get_mem_block()'
collect2: error: ld returned 1 exit status
make: *** [Makefile:876: openscad] Error 1

sl1pkn07 commented on 2016-12-26 18:03

openscad-git E: Dependency libzip detected and not included (libraries ['usr/lib/'] needed in files ['usr/bin/openscad'])

gregor commented on 2015-12-14 17:25

i tried to install but i get the following:

yacc -d -p parser -b parser src/parser.y
make: yacc: Command not found
Makefile:1201: recipe for target 'parser_yacc.h' failed
make: *** [parser_yacc.h] Error 127
==> ERROR: A failure occurred in build().

UPDATE: bison was missing. somebody should add it to the dependencies

keenerd commented on 2015-05-31 13:12

Doesn't run entirely fine, you will occasionally get large black squares over the UI. But now you can help debug those.

stevenhoneyman commented on 2015-05-23 12:00

Please update to qt5. It's supported and compiles and runs fine without any modifications needed.

yar commented on 2014-09-23 22:59

Looks like this needs to depend on 'qscintilla'.

keenerd commented on 2014-02-28 19:04

Working pkgbuild:

danmilon commented on 2014-02-19 20:43

Ignore my previous comment. Hadn't synced pacman recently.

danmilon commented on 2014-02-19 20:41

Some dependencies fail. Any idea?

==> Install or build missing dependencies for openscad-git:
error: target not found: cgal
error: target not found: opencsg

grunch commented on 2013-12-16 13:56

Anybody else reporting SIGSEGV with the current version(s) of openscad? I'm experiencing this when trying to Compile and Render (CGAL) any model. This happens with both the "openscad-git" and the "openscad" AUR packages. *And* it happens on my Gentoo installation with the same version of openscad. I'm thinking it's an upstream issue, but thought I would check here first.