Warning: file_exists(): open_basedir restriction in effect. File(/srv/http/vhosts/aur.archlinux.org/public/web/locale//en/LC_MESSAGES/aurweb.mo) is not within the allowed path(s): (/srv/http/vhosts/aur-dev.archlinux.org/:/etc/aurweb/) in /srv/http/vhosts/aur-dev.archlinux.org/public/web/lib/streams.php on line 90
AUR (en) - openrc-sysvinit

Notice: Undefined variable: name in /srv/http/vhosts/aur-dev.archlinux.org/public/web/lib/pkgfuncs.inc.php on line 248

Package Details: openrc-sysvinit 2.88-10

Git Clone URL: https://aur-dev.archlinux.org/openrc-sysvinit.git (read-only)
Package Base: openrc-sysvinit
Description: Linux System V Init patched to use alternate inittab for openrc
Upstream URL: http://savannah.nongnu.org/projects/sysvinit
Licenses: GPL
Groups: base
Submitter: apg
Maintainer: apg
Last Packager: apg
Votes: 19
Popularity: 0.613055
First Submitted: 2012-10-11 15:57
Last Updated: 2015-07-08 05:24

Latest Comments

von commented on 2013-11-07 09:53

fails to build:

shutdown.c: In function ‘main’:
shutdown.c:485:10: warning: variable ‘realuid’ set but not used [-Wunused-but-set-variable]
uid_t realuid;
wall.c: In function ‘main’:
wall.c:113:2: warning: format ‘%d’ expects argument of type ‘int’, but argument 5 has type ‘size_t’ [-Wformat=]
whoami, i, strlen(buf));
sulogin.o: In function `main':
sulogin.c:(.text.startup+0x2f0): undefined reference to `crypt'
collect2: error: ld returned 1 exit status
<builtin>: recipe for target 'sulogin' failed
make[1]: *** [sulogin] Error 1
make[1]: *** Waiting for unfinished jobs....
make[1]: Leaving directory '/tmp/openrc-sysvinit/src/sysvinit-2.88dsf/src'
Makefile:2: recipe for target 'all' failed
make: *** [all] Error 2

artoo commented on 2012-11-10 10:06

Same comment as on openrc.sysvinit: