Notice: Undefined variable: name in /srv/http/vhosts/ on line 248

Package Details: odamex 0.7.0-2

Git Clone URL: (read-only)
Package Base: odamex
Description: A free client/server multiplayer engine for the classic FPS Doom.
Upstream URL:
Licenses: GPL
Submitter: None
Maintainer: miffe
Last Packager: miffe
Votes: 10
Popularity: 0.000227
First Submitted: 2007-02-26 16:18
Last Updated: 2015-06-08 13:55

Dependencies (4)

Required by (2)

Sources (2)

Latest Comments

« First ‹ Previous 1 2 3

Anonymous comment on 2012-01-11 04:18

Anyone else having problems with no music? I have timidity++ installed already, but no bgm will play.

Zucca commented on 2011-12-28 05:56

Thanks for keepin this up to date.
I think I'll switch from -svn to this as servers won't always accept -svn clients.

miffe commented on 2011-11-06 14:52

odamex 0.5.6-1:
- New upstream release

miffe commented on 2011-08-12 18:25

odamex 0.5.4-1:
- New upstream release

Zucca commented on 2011-08-03 19:54

@miffe: Yeah. It compiled fine. :)
But I already built odamex-svn. ;)

miffe commented on 2011-07-30 09:18

odamex 0.5.3-1:
- New upstream release

@Zucca: I hope this version fixes your problem.

Zucca commented on 2011-07-28 17:41

I stumble upon this error:

g++ -march=core2 -O2 -pipe -DUNIX -DLINUX -DNOASM -Icommon -Itextscreen -I../client/sdl -Iclient/sdl -I../client/src -Iclient/src -I/usr/include/SDL -D_GNU_SOURCE=1 -D_REENTRANT -c common/p_switch.cpp -o obj/common/client_p_switch.o
common/r_data.cpp: In function ‘void R_InitColormaps()’:
common/r_data.cpp:729:29: error: ‘ptrdiff_t’ was not declared in this scope
common/r_data.cpp:729:29: note: suggested alternatives:
/usr/lib/gcc/x86_64-unknown-linux-gnu/4.6.1/../../../../include/c++/4.6.1/x86_64-unknown-linux-gnu/bits/c++config.h:156:28: note: ‘std::ptrdiff_t’
/usr/lib/gcc/x86_64-unknown-linux-gnu/4.6.1/../../../../include/c++/4.6.1/x86_64-unknown-linux-gnu/bits/c++config.h:156:28: note: ‘std::ptrdiff_t’
common/r_data.cpp:729:39: error: expected ‘)’ before ‘realcolormaps’
common/r_data.cpp:729:67: error: expected ‘)’ before ‘;’ token
make: *** [obj/common/client_r_data.o] Error 1

miffe commented on 2011-01-18 09:02

Binary packages available:

Server =$arch/

miffe commented on 2011-01-14 16:22

Package adopted.

odamex 0.5.1-1:
- New upstream release.