Notice: Undefined variable: name in /srv/http/vhosts/ on line 248

Package Details: octave-hg 4.3.0+23146.f268b33a96d3-1

Git Clone URL: (read-only)
Package Base: octave-hg
Description: A high-level language, primarily intended for numerical computations.
Upstream URL:
Licenses: GPL
Conflicts: octave
Provides: octave=4.2.0
Submitter: haawda
Maintainer: haawda
Last Packager: haawda
Votes: 7
Popularity: 0.000017
First Submitted: 2009-10-01 23:27
Last Updated: 2017-02-04 17:35

Required by (85)

Sources (1)

Latest Comments

1 2 3 4 5 6 ... Next › Last »

divinesheet commented on 2017-01-30 22:36


I have one request for you:
Could you please stop updating the package with the latest existing commit?

I mean, since the PKGBUILD is working flawlessly and always fetching the latest commit, there is no actual reason to update the package.

It'd be great if you could update the package when a fix on PKGBUILD should be added other than just the latest commit hash.


haawda commented on 2016-11-30 06:06

No, it is not needed.

bminaker commented on 2016-11-29 21:53 lists llvm as make requirement, but not listed in PKGBUILD.

Is it needed?

haawda commented on 2016-08-11 17:18

Updated, the new PKGBUILD was heavily rewritten and works for me.

haawda commented on 2016-08-11 14:32

The PKGBUILD did not work for me, too, since yesterday. Please try, if the moc related variables in the configure line are the culprit, by removing them.

But I have also other issues. I hope to fix the soon.

flipmess commented on 2016-08-10 20:17

got this recently:

CXX libgui/src/libgui_src_libgui_src_la-shortcut-manager.lo
In file included from ../libgui/src/
libgui/src/ui-settings-dialog.h:13:25: fatal error: QtGui/QAction: No such file or directory
#include <QtGui/QAction>
compilation terminated.
make[2]: *** [Makefile:16794: libgui/src/libgui_src_libgui_src_la-settings-dialog.lo] Error 1
make[2]: *** Waiting for unfinished jobs....
make[2]: Leaving directory '/tmp/yaourt-tmp-flipmess/aur-octave-hg/src/octave-local/build'
make[1]: *** [Makefile:26153: all-recursive] Error 1
make[1]: Leaving directory '/tmp/yaourt-tmp-flipmess/aur-octave-hg/src/octave-local/build'
make: *** [Makefile:9895: all] Error 2
==> ERROR: A failure occurred in build().
==> ERROR: Makepkg was unable to build octave-hg.

thx for your help

haawda commented on 2016-07-23 11:52

Builds again...

haawda commented on 2016-06-07 14:30

Right now this does not build due to two upstrema related problems: first, it is not gcc6.1.1-ready, second, there also exists a problem possibly related to gnulib. Both are addressed upstream, so I cannot do much about it. Maybe it helps to downgrade gcc to some 5.x version.

flipmess commented on 2016-06-07 14:24

is this still on? ^^

haawda commented on 2016-02-05 16:15

Strange, /usr/lib/jvm/java-8-openjdk/jre/include should be there, if java-environment is installed. And that group _is_ in the deps.