Notice: Undefined variable: name in /srv/http/vhosts/ on line 248

Package Details: nightingale-git 78bd501-1

Git Clone URL: (read-only)
Package Base: nightingale-git
Description: Open source fork of the Songbird Media Player. Uses prebuilt xulrunner and sqlite.
Upstream URL:
Licenses: GPL2, BSD, MPL
Conflicts: nightingale
Provides: nightingale
Submitter: ilikenwf
Maintainer: ilikenwf
Last Packager: ilikenwf
Votes: 34
Popularity: 0.081497
First Submitted: 2011-09-27 15:44
Last Updated: 2016-06-19 04:11

Latest Comments

1 2 3 4 5 6 ... Next › Last »

ilikenwf commented on 2016-07-31 18:18

Did you try it with American English on your own build?

I haven't rebuilt in a while but using gcc5 is imperative.

kaipee commented on 2016-07-31 15:47

UPDATE: there seems to be a problem with the building of this package. Downloading the official (pre-built) packages cause no issues whatsoever, so far. I've tested all versions (32/64bit and standard Linux/Gnome integration) and they all run file, although they seem to not like British English as language.

kaipee commented on 2016-07-31 15:23

Nightingale seems to immediately crash once 'focussed' / clicked on. Crash and coredump everytime.


(process:20944): GLib-CRITICAL **: g_slice_set_config: assertion 'sys_page_size == 0' failed

(nightingale-bin:20944): Gdk-WARNING **: gdk_window_set_icon_list: icons too large

(nightingale-bin:20944): Gdk-WARNING **: gdk_window_set_icon_list: icons too large

(nightingale-bin:20944): Gdk-WARNING **: gdk_window_set_icon_list: icons too large
/opt/nightingale/nightingale: line 146: 20944 Segmentation fault (core dumped) "$prog" ${1+"$@"}

ilikenwf commented on 2016-06-17 05:57

Ok, so gcc5 mostly fixed it, but for whatever reason, the sqlite dependency will build fine, but xulr now does not (what in Arch has changed other than gcc enough to cause this???). At the end of the build, the compiled files aren't accessible and won't execute properly.

As a result, gcc5 and the use of the binary dependency prebuilts from our (nightingale's) downloads area are being used again until we can either find why these won't build anymore, or something else changes.

If anyone can tell me why we get "permission denied" errors unless we're root for building (or possibly outside of makepkg?) and how to fix, that'd be great so we can go back to non blob builds.

ilikenwf commented on 2016-06-16 13:40

@JohnRobson I think I need to make gcc5 a build dependency and set the mozconfig to use it. You can wait until I do, or try it, but I know mozilla doesn't built with gcc6.

JohnRobson commented on 2016-06-16 05:34

make[5]: *** [/tmp/yaourt-tmp-us/aur-nightingale-git/src/nightingale-deps/xulrunner-1.9.2/mozilla/config/ file_util.o] Error 1
make[5]: *** Waiting for unfinished jobs....
/tmp/yaourt-tmp-us/aur-nightingale-git/src/nightingale-deps/xulrunner-1.9.2/mozilla/ipc/chromium/src/base/ In destructor ‘mozilla::Logger::~Logger()’:
/tmp/yaourt-tmp-us/aur-nightingale-git/src/nightingale-deps/xulrunner-1.9.2/mozilla/ipc/chromium/src/base/ warning: variable ‘prlevel’ set but not used [-Wunused-but-set-variable]
PRLogModuleLevel prlevel = PR_LOG_DEBUG;
In file included from /tmp/yaourt-tmp-us/aur-nightingale-git/src/nightingale-deps/xulrunner-1.9.2/mozilla/ipc/chromium/src/base/lock_impl.h:16:0,
from /tmp/yaourt-tmp-us/aur-nightingale-git/src/nightingale-deps/xulrunner-1.9.2/mozilla/ipc/chromium/src/base/lock.h:8,
from /tmp/yaourt-tmp-us/aur-nightingale-git/src/nightingale-deps/xulrunner-1.9.2/mozilla/ipc/chromium/src/base/histogram.h:38,
from /tmp/yaourt-tmp-us/aur-nightingale-git/src/nightingale-deps/xulrunner-1.9.2/mozilla/ipc/chromium/src/base/message_loop.h:13,
from /tmp/yaourt-tmp-us/aur-nightingale-git/src/nightingale-deps/xulrunner-1.9.2/mozilla/ipc/chromium/src/base/
/tmp/yaourt-tmp-us/aur-nightingale-git/src/nightingale-deps/xulrunner-1.9.2/mozilla/ipc/chromium/src/base/basictypes.h: In function ‘Dest bit_cast(const Source&)’:
/tmp/yaourt-tmp-us/aur-nightingale-git/src/nightingale-deps/xulrunner-1.9.2/mozilla/ipc/chromium/src/base/basictypes.h:370:16: warning: typedef ‘VerifySizesAreEqual’ locally defined but not used [-Wunused-local-typedefs]
typedef char VerifySizesAreEqual [sizeof(Dest) == sizeof(Source) ? 1 : -1];
make[5]: Leaving directory '/tmp/yaourt-tmp-us/aur-nightingale-git/src/nightingale-deps/xulrunner-1.9.2/mozilla/compiled/xulrunner-release/ipc/chromium'
make[4]: *** [/tmp/yaourt-tmp-us/aur-nightingale-git/src/nightingale-deps/xulrunner-1.9.2/mozilla/config/ libs_tier_xpcom] Error 2
make[4]: Leaving directory '/tmp/yaourt-tmp-us/aur-nightingale-git/src/nightingale-deps/xulrunner-1.9.2/mozilla/compiled/xulrunner-release'
make[3]: *** [/tmp/yaourt-tmp-us/aur-nightingale-git/src/nightingale-deps/xulrunner-1.9.2/mozilla/config/ tier_xpcom] Error 2
make[3]: Leaving directory '/tmp/yaourt-tmp-us/aur-nightingale-git/src/nightingale-deps/xulrunner-1.9.2/mozilla/compiled/xulrunner-release'
make[2]: *** [/tmp/yaourt-tmp-us/aur-nightingale-git/src/nightingale-deps/xulrunner-1.9.2/mozilla/config/ default] Error 2
make[2]: Leaving directory '/tmp/yaourt-tmp-us/aur-nightingale-git/src/nightingale-deps/xulrunner-1.9.2/mozilla/compiled/xulrunner-release'
make[1]: *** [ build] Error 2
make[1]: Leaving directory '/tmp/yaourt-tmp-us/aur-nightingale-git/src/nightingale-deps/xulrunner-1.9.2/mozilla'
make: *** [Makefile.songbird:130: xr-build-release] Error 2
make: Leaving directory '/tmp/yaourt-tmp-us/aur-nightingale-git/src/nightingale-deps/xulrunner-1.9.2'
==> ERROR: A failure occurred in build().
==> ERROR: Makepkg was unable to build nightingale-git.

e-anima commented on 2016-03-14 19:39

tar (child): /tmp/yaourt-tmp-marco/aur-nightingale-git/src/nightingale-hacking/dependencies/linux-x86_64/xulrunner-1.9.2/release/xulrunner.tar.bz2:
somehow Error file not found.

Full error was: (sorry for german text)

tar (child): /tmp/yaourt-tmp-marco/aur-nightingale-git/src/nightingale-hacking/dependencies/linux-x86_64/xulrunner-1.9.2/release/xulrunner.tar.bz2: Funktion open fehlgeschlagen: Datei oder Verzeichnis nicht gefunden
tar (child): Error is not recoverable: exiting now
tar: Child returned status 2
tar: Error is not recoverable: exiting now
Makefile:524: die Regel für Ziel „export“ scheiterte
make[4]: *** [export] Fehler 2
make[4]: Verzeichnis „/tmp/yaourt-tmp-marco/aur-nightingale-git/src/nightingale-hacking/compiled/dependencies“ wird verlassen
/tmp/yaourt-tmp-marco/aur-nightingale-git/src/nightingale-hacking/build/ die Regel für Ziel „export_tier_deps“ scheiterte
make[3]: *** [export_tier_deps] Fehler 2
make[3]: Verzeichnis „/tmp/yaourt-tmp-marco/aur-nightingale-git/src/nightingale-hacking/compiled“ wird verlassen
/tmp/yaourt-tmp-marco/aur-nightingale-git/src/nightingale-hacking/build/ die Regel für Ziel „tier_deps“ scheiterte
make[2]: *** [tier_deps] Fehler 2
make[2]: Verzeichnis „/tmp/yaourt-tmp-marco/aur-nightingale-git/src/nightingale-hacking/compiled“ wird verlassen
/tmp/yaourt-tmp-marco/aur-nightingale-git/src/nightingale-hacking/build/ die Regel für Ziel „default“ scheiterte
make[1]: *** [default] Fehler 2
make[1]: Verzeichnis „/tmp/yaourt-tmp-marco/aur-nightingale-git/src/nightingale-hacking/compiled“ wird verlassen
Makefile:197: die Regel für Ziel „build“ scheiterte
make: *** [build] Fehler 2

ilikenwf commented on 2015-11-17 16:04

Great! Thanks for the help debugging! This is a better way of doing it, as it keeps from having to use a precompiled xulrunner.

mareke commented on 2015-10-10 07:12

It's working now!

ilikenwf commented on 2015-10-10 00:09

It should work now - please retry.