Warning: file_exists(): open_basedir restriction in effect. File(/srv/http/vhosts/aur.archlinux.org/public/web/locale//en/LC_MESSAGES/aurweb.mo) is not within the allowed path(s): (/srv/http/vhosts/aur-dev.archlinux.org/:/etc/aurweb/) in /srv/http/vhosts/aur-dev.archlinux.org/public/web/lib/streams.php on line 90
AUR (en) - nasc-bzr

Notice: Undefined variable: name in /srv/http/vhosts/aur-dev.archlinux.org/public/web/lib/pkgfuncs.inc.php on line 248

Package Details: nasc-bzr r75-1

Git Clone URL: https://aur-dev.archlinux.org/nasc-bzr.git (read-only)
Package Base: nasc-bzr
Description: Do maths like a normal person.
Upstream URL: http://parnold-x.github.io/nasc/
Licenses: GPL3
Conflicts: nasc-bzr
Provides: nasc-bzr
Submitter: tydell
Maintainer: tydell
Last Packager: tydell
Votes: 5
Popularity: 0.000020
First Submitted: 2015-01-18 14:42
Last Updated: 2015-09-06 11:42

Latest Comments

matma6 commented on 2016-08-29 23:47

make[3]: warning: jobserver unavailable: using -j1. Add '+' to parent make rule.
QalculateNasc.cc: In function ‘char* get_function_arguments(int)’:
QalculateNasc.cc:90:85: error: ‘transform’ was not declared in this scope
transform (str.begin(), str.end(), str.begin(), (int (*) (int) ) tolower);
^
QalculateNasc.cc: In function ‘char* get_function_arguments_list(int)’:
QalculateNasc.cc:114:85: error: ‘transform’ was not declared in this scope
transform (str.begin(), str.end(), str.begin(), (int (*) (int) ) tolower);
^
QalculateNasc.cc: In function ‘void abort()’:
QalculateNasc.cc:199:10: error: declaration of ‘void abort()’ has a different exception specifier
void abort() {
^~~~~
In file included from QalculateNasc.cc:3:0:
QalculateNasc.h:15:6: note: from previous declaration ‘void abort() throw ()’
void abort();
^~~~~
QalculateNasc.cc: In function ‘void abort()’:
QalculateNasc.cc:201:5: warning: ‘noreturn’ function does return
}
^
make[3]: *** [Makefile:16: QalculateNasc.o] Error 1
make[2]: *** [CMakeFiles/libqalculatenasc.dir/build.make:111: ../libqalculatenasc/src/libqalculatenasc-stamp/libqalculatenasc-build] Error 2
make[1]: *** [CMakeFiles/Makefile2:68: CMakeFiles/libqalculatenasc.dir/all] Error 2
make: *** [Makefile:128: all] Error 2
==> ERARO: Malsukceso okazis en build().

vivaeltopo commented on 2015-08-19 08:41

Requires cmake, please add this as dependency to build

gileri commented on 2015-03-22 22:14

It also needs 'cmake' to build (makedepends)

tydell commented on 2015-01-23 08:24

Thanks a lot, dependencies are completed. Now package builds fine.

spirtbrat commented on 2015-01-22 05:22

You also need to add 'vala' and 'bzr' as dependencies.

vivaeltopo commented on 2015-01-21 14:56

Needs 'granite' to build (can be found in [community])
You might want to add this as dependency.