Warning: file_exists(): open_basedir restriction in effect. File(/srv/http/vhosts/aur.archlinux.org/public/web/locale//en/LC_MESSAGES/aurweb.mo) is not within the allowed path(s): (/srv/http/vhosts/aur-dev.archlinux.org/:/etc/aurweb/) in /srv/http/vhosts/aur-dev.archlinux.org/public/web/lib/streams.php on line 90
AUR (en) - mysql

Notice: Undefined variable: name in /srv/http/vhosts/aur-dev.archlinux.org/public/web/lib/pkgfuncs.inc.php on line 248

Package Details: mysql 5.7.16-1

Git Clone URL: https://aur-dev.archlinux.org/mysql.git (read-only)
Package Base: mysql
Description: Fast SQL database server, community edition
Upstream URL: https://www.mysql.com/products/community/
Licenses: GPL
Conflicts: mariadb
Provides: mariadb=5.7.16
Submitter: Barthalion
Maintainer: Muflone
Last Packager: Muflone
Votes: 44
Popularity: 1.427572
First Submitted: 2013-04-25 19:13
Last Updated: 2016-10-16 22:32

Required by (156)

Sources (5)

Latest Comments

1 2 3 4 5 6 ... Next › Last »

Sirced commented on 2017-01-24 23:47

@mrrabinhalder @matoro

I was running into the same issue. I fixed it by manually removing my previous maraidb installation before installing. For me it was mariadb-clients, libmariasbclient and mariadb. Possibly they should be conflicting but aren"t.

Hope this helps.

mrrabinhalder commented on 2016-12-25 13:21

Compilation has failed with the following error message:

[ 53%] Linking CXX executable pfs_connect_attr-t
../libperfschema.a(pfs_instr.cc.o): In function `fct_update_file_derived_flags':
/home/rhalder/aur/yaourt-tmp-rhalder/aur-mysql/src/mysql-5.7.16/storage/perfschema/pfs_instr.cc:2087:(.text+0x7ba3): relocation truncated to fit: R_X86_64_16 against symbol `sanitize_file_class(PFS_file_class*)' defined in .text section in ../libperfschema.a(pfs_instr_class.cc.o)
../../innobase/libinnobase.a(dict0crea.cc.o): In function `std::__cxx11::basic_ostringstream<char, std::char_traits<char>, std::allocator<char> >::basic_ostringstream(std::_Ios_Openmode)':
/usr/include/c++/6.2.1/sstream:549:(.text+0x73c1): relocation truncated to fit: R_X86_64_16 against symbol `std::basic_ios<char, std::char_traits<char> >::init(std::basic_streambuf<char, std::char_traits<char> >*)@@GLIBCXX_3.4' defined in .plt section in /usr/lib/gcc/x86_64-pc-linux-gnu/6.2.1/../../../../lib/crt1.o
collect2: error: ld returned 1 exit status
make[2]: *** [storage/perfschema/unittest/CMakeFiles/pfs_connect_attr-t.dir/build.make:197: storage/perfschema/unittest/pfs_connect_attr-t] Error 1
make[1]: *** [CMakeFiles/Makefile2:1705: storage/perfschema/unittest/CMakeFiles/pfs_connect_attr-t.dir/all] Error 2
make: *** [Makefile:161: all] Error 2

Any help?

matoro commented on 2016-09-14 03:45

Compilation is failing with the following error message:

CMakeFiles/mysqltest_embedded.dir/__/__/client/mysqltest.cc.o:(.data.rel+0x13e0): undefined reference to `my_charset_latin1'
collect2: error: ld returned 1 exit status
make[2]: *** [libmysqld/examples/CMakeFiles/mysqltest_embedded.dir/build.make:99: libmysqld/examples/mysqltest_embedded] Error 1
make[1]: *** [CMakeFiles/Makefile2:7972: libmysqld/examples/CMakeFiles/mysqltest_embedded.dir/all] Error 2
make: *** [Makefile:161: all] Error 2

List of packages I have installed: https://spit.mixtape.moe/view/raw/dd3f08c9
It's on a standard x86_64 laptop, kernel version 4.7.2. Any help?

Muflone commented on 2016-07-02 16:05

the 'provides' option is used to mark the package as a replacement for another package. If some application has mariadb like dependency (any package in the official repository cannot have a dependency on mysql), this package can be a candidate for replacement. Obviously the two packages are different in many ways.

kerberizer commented on 2016-07-01 12:37

I think those AUR helpers should be banned. :)

@colshacol, on a more serious note, what's the AUR helper that you used to install this package, indeed? If that sounds like Chinese to you, then just please explain briefly how you installed MySQL.

colshacol commented on 2016-07-01 12:24

@Muflone Forgive my novice, I have never used MySQL nor MariaDB. But, I saw that you said that this has nothing to do with MariaDB, yet it says "provides: mariadb" above, and upon checking mysql --version, I get "Ver 15.1 Distrib 10.1.14-MariaDB, for Linux (x86_64) using readline 5.1".

I am not complaining. I do not even know the difference! I am just curious as to why you say it is not related to Maria at all.

ijann commented on 2016-06-28 00:27

My apologies, that line of code @kerberizer I fix everything the
problem, that rare that pass this, anyway I regret the anger I had with
@Muflone, I'm happy :D
video remove
translate with Bing

Muflone commented on 2016-06-27 21:14

I hope it will be cleared that your AUR helper (the program you're using to download the packages) is doing mess.
The package mysql is in the AUR while the package mariadb is in the official Arch Linux repository. Your AUR helper is downloading mariadb from the repository instead of the AUR package mysql.

Just download the package from the AUR, like kerberizer pointed and be happy with mysql.

ijann commented on 2016-06-27 21:05

ok @kerberizer take what I say and you dare my conclusions.

Not understand that this repository will not arrange the pkgbuild and is
avoid this mess,

Thanks for responding

kerberizer commented on 2016-06-27 20:32

@ijann, as Scimmia already explained, the problem is with __your__ AUR helper, whatever it is. Please use plain makepkg instead, e.g.:

$ git clone https://aur.archlinux.org/mysql.git
$ cd mysql
$ makepkg -cCifs

Better yet, read about it on the Wiki. There's information in Spanish too...


Edit: Unfortunately, the links got broken, so please use copy-paste on them instead.