Warning: file_exists(): open_basedir restriction in effect. File(/srv/http/vhosts/aur.archlinux.org/public/web/locale//en/LC_MESSAGES/aurweb.mo) is not within the allowed path(s): (/srv/http/vhosts/aur-dev.archlinux.org/:/etc/aurweb/) in /srv/http/vhosts/aur-dev.archlinux.org/public/web/lib/streams.php on line 90
AUR (en) - mp3diags-unstable

Notice: Undefined variable: name in /srv/http/vhosts/aur-dev.archlinux.org/public/web/lib/pkgfuncs.inc.php on line 248

Package Details: mp3diags-unstable 1.3.04-1

Git Clone URL: https://aur-dev.archlinux.org/mp3diags-unstable.git (read-only)
Package Base: mp3diags-unstable
Description: Identify issues with your MP3 files, fix those issues and make other changes
Upstream URL: http://mp3diags.sourceforge.net/
Licenses: GPL
Submitter: Harey
Maintainer: Harey
Last Packager: Harey
Votes: 8
Popularity: 0.416594
First Submitted: 2012-05-15 07:13
Last Updated: 2016-08-01 09:35

Dependencies (4)

Required by (0)

Sources (1)

Latest Comments

1 2 Next › Last »

Harey commented on 2016-08-01 09:29

updated to 1.3.04, no patch needed anymore

Harey commented on 2016-07-03 17:07

You have to download a snapshot, not only the PKGBUILD. The patch is included there.

yorrd commented on 2016-07-02 10:56

==> Starting build()...
/tmp/yaourt-tmp-username/aur-mp3diags-unstable/./PKGBUILD: line 18: ../patch.diff: No such file or directory
==> ERROR: A failure occurred in build().
Aborting...

I've already cleared all existing files related to this build

Harey commented on 2016-06-30 09:00

Thanks to the help of the program author the program compiles again. It failed due to some C++ 11 changes.

Harey commented on 2016-06-27 11:57

It's not out-of-date... But it doesn't build here as well at the moment. I'm investigating this, but I'm short on time atm. Does anybody have a clue. Must be in some recent arch updates...

jo-shva commented on 2016-06-24 11:51

Does not build,
make[2]: Leaving directory '/tmp/makepkg/mp3diags-unstable/src/MP3Diags-unstable-1.3.03/src'
make[1]: *** [Makefile:34: release] Error 2
make[1]: Leaving directory '/tmp/makepkg/mp3diags-unstable/src/MP3Diags-unstable-1.3.03/src'
make: *** [Makefile:39: sub-src-make_default] Error 2

mocambo commented on 2016-01-10 20:56

Can it be unlinked from boost-libs versioning ?
Boost-libs are already updated to 1.60 but mp3diags-unstable searches for 1.58.0.
"MP3Diags-unstable: error while loading shared libraries: libboost_serialization.so.1.58.0: cannot open shared object file: No such file or directory".
libboost_serialization.so is sufficient.

Harey commented on 2015-03-22 10:20

updated to 1.3.03

Harey commented on 2014-07-27 10:20

Update to 1.3.01

Harey commented on 2014-01-17 10:38

Update to 1.3.0