Warning: file_exists(): open_basedir restriction in effect. File(/srv/http/vhosts/aur.archlinux.org/public/web/locale//en/LC_MESSAGES/aurweb.mo) is not within the allowed path(s): (/srv/http/vhosts/aur-dev.archlinux.org/:/etc/aurweb/) in /srv/http/vhosts/aur-dev.archlinux.org/public/web/lib/streams.php on line 90
AUR (en) - minetest-git

Notice: Undefined variable: name in /srv/http/vhosts/aur-dev.archlinux.org/public/web/lib/pkgfuncs.inc.php on line 248

Package Details: minetest-git 20160819.a496224-1

Git Clone URL: https://aur-dev.archlinux.org/minetest-git.git (read-only)
Package Base: minetest-git
Description: Infiniminer/Minecraft inspired game
Upstream URL: http://www.minetest.net/
Licenses: CCPL:by-sa, LGPL2.1
Conflicts: minetest, minetest-common, minetest-server
Provides: minetest, minetest-common, minetest-server
Submitter: None
Maintainer: vesath
Last Packager: vesath
Votes: 40
Popularity: 0.468587
First Submitted: 2011-09-27 12:43
Last Updated: 2016-08-20 01:56

Required by (10)

Sources (2)

Latest Comments

1 2 3 4 Next › Last »

vesath commented on 2016-08-20 01:56

MadTux: Thanks for noticing! It's this bug: https://github.com/minetest/minetest/issues/4446
It should be fixed upstream soon, but in the meantime I've fixed our build by adding -DENABLE_GETTEXT=TRUE as cmake argument.

MadTux commented on 2016-08-18 11:29

It doesn't compile for me:

In file included from /tmp/makepkg/minetest-git/src/minetest/src/gettext.cpp:24:0:
/usr/include/libintl.h:39:14: error: expected unqualified-id before ‘char’
extern char *gettext (const char *__msgid)
^
/usr/include/libintl.h:39:14: error: expected initializer before ‘char’
make[2]: *** [src/CMakeFiles/minetest.dir/build.make:3039: src/CMakeFiles/minetest.dir/gettext.cpp.o] Error 1
make[2]: *** Waiting for unfinished jobs....
make[1]: *** [CMakeFiles/Makefile2:147: src/CMakeFiles/minetest.dir/all] Error 2
make: *** [Makefile:150: all] Error 2

vesath commented on 2016-01-24 05:48

Thanks for the report, I'll add that build option straight away.

shellkr commented on 2016-01-24 00:56

I had a problem where Minetest would ignore mods in /usr/share/minetest/mods. Apparently you need to set a build option.

From the instructions on Mintests github:
"- If you want to install it system-wide (or are making a distribution package), you will want to use -DRUN_IN_PLACE=FALSE"

Not having this makes it problematic to install mod packages as they will be put in the /usr dir. So users will have to move them manually from /usr to /home. Not very KISS in other words.
https://github.com/minetest/minetest/issues/3597

vesath commented on 2015-03-04 03:13

Thanks; that's fixed in the new version I've just uploaded.

Arch-TK commented on 2015-03-03 23:01

This package should conflict with minetest-common (and provide it).

Morn commented on 2014-03-16 09:16

Could you add "-DENABLE_FREETYPE=on -DENABLE_LEVELDB=on -DENABLE_CURL=on" (and its dependencies) to this PKGBUILD, vesath? Scalable fonts are so worth it for fullscreen and LevelDB is becoming more and more popular as a backend.

vesath commented on 2013-12-11 06:03

Strange, it did not use to build against libIrrlicht. Well, alright, I'll add it.

vesath commented on 2013-12-11 06:03

Well, did not use to build against libIrrlicht. Anyhow, I'll add it.

wenLiangcan commented on 2013-12-11 05:10

Minetest needs libIrrlicht.so.1.8, so, irrlicht should be defined as depends rather than makedepends.