Warning: file_exists(): open_basedir restriction in effect. File(/srv/http/vhosts/aur.archlinux.org/public/web/locale//en/LC_MESSAGES/aurweb.mo) is not within the allowed path(s): (/srv/http/vhosts/aur-dev.archlinux.org/:/etc/aurweb/) in /srv/http/vhosts/aur-dev.archlinux.org/public/web/lib/streams.php on line 90
AUR (en) - magics++

Notice: Undefined variable: name in /srv/http/vhosts/aur-dev.archlinux.org/public/web/lib/pkgfuncs.inc.php on line 248

Package Details: magics++ 2.30.0-1

Git Clone URL: https://aur-dev.archlinux.org/magics++.git (read-only)
Package Base: magics++
Description: Magics is the latest generation of the ECMWF's Meteorological plotting software MAGICS.
Upstream URL: https://software.ecmwf.int/wiki/display/MAGP
Licenses: Apache
Submitter: graziano
Maintainer: graziano
Last Packager: graziano
Votes: 0
Popularity: 0.000000
First Submitted: 2016-03-28 17:02
Last Updated: 2016-12-22 11:07

Latest Comments

graziano commented on 2017-01-18 21:04

freetype2 error...
Check this:
https://www.ostechnix.com/fix-harfbuzz-infinality-issue-arch-linux/

tmaldo23 commented on 2017-01-18 17:31

I am having this error,

[ 99%] Linking CXX executable ../../bin/metgramx
CMakeFiles/metgramx.dir/metgramx.cc.o: In function `TempFile::TempFile()':
/home/tito/sources/magics++/src/Magics-2.30.0-Source/apps/metgram/metgramx.cc:70: warning: the use of `tmpnam' is dangerous, better use `mkstemp'
/usr/lib/libharfbuzz.so.0: undefined reference to `FT_Get_Var_Blend_Coordinates'
collect2: error: ld returned 1 exit status
make[2]: *** [apps/metgram/CMakeFiles/metgramx.dir/build.make:127: bin/metgramx] Error 1
make[1]: *** [CMakeFiles/Makefile2:2204: apps/metgram/CMakeFiles/metgramx.dir/all] Error 2
make: *** [Makefile:161: all] Error 2

kubrick commented on 2016-04-10 11:59

The pkgbuild file needs:

depends=('grib_api' 'boost' 'perl-xml-parser')

to build and run

and src/drivers/CairoDriver.cc lines 542 & 543 need to be patched (replace "." with ")" )

dumbojumbo commented on 2016-04-02 14:41

I'm unable to build the package as there is an error in
/src/driver/CairoDriver.cc
line 542 and 543. Unbalanced brackets!. I don't know how to patch this. It would be nice if someone can help me with this or if the maintainer can patch for the rest of the users. Thanks in advance!