Notice: Undefined variable: name in /srv/http/vhosts/aur-dev.archlinux.org/public/web/lib/pkgfuncs.inc.php on line 248

Package Details: llpp-git 22.r71.g2bf99be-1

Git Clone URL: https://aur-dev.archlinux.org/llpp-git.git (read-only)
Package Base: llpp-git
Description: Fast, featureful PDF viewer based on MuPDF.
Upstream URL: http://repo.or.cz/w/llpp.git
Licenses: custom
Conflicts: llpp
Provides: llpp
Submitter: mfwitten
Maintainer: None
Last Packager: drrossum
Votes: 61
Popularity: 0.000073
First Submitted: 2010-10-26 22:21
Last Updated: 2016-01-11 17:25

Dependencies (23)

Required by (0)

Sources (1)

Latest Comments

« First ‹ Previous ... 2 3 4 5 6 7 8 9 Next › Last »

xmw commented on 2012-01-28 22:31

Given memento.h from mupdf-git is installed in /usr/include

sed -e s/pdf_xref/pdf_document/ \
-e s/pdf_open_xref/pdf_open_document/ \
-e s/pdf_free_xref/pdf_close_document/ \
-i link.c || die

chneukirchen commented on 2012-01-23 15:26

Anyone know how to fix this?

./link.c:384:5: error: too many arguments to function ‘pdf_open_xref’
./link.c:627:5: error: too many arguments to function ‘fz_new_draw_device’
./link.c:628:5: error: too few arguments to function ‘pdf_run_page’
./link.c:765:25: error: ‘fz_outline’ has no member named ‘page’
./link.c:862:9: error: too few arguments to function ‘pdf_run_page’
./link.c:1206:5: error: unknown type name ‘pdf_link’
./link.c:1217:57: error: request for member ‘next’ in something not a structure or union
./link.c:1221:20: error: request for member ‘rect’ in something not a structure or union

chneukirchen commented on 2012-01-03 15:25

repo.or.cz seems to have issues, use _gitroot=http://repo.or.cz/r/llpp.git for now.

Barthalion commented on 2011-11-30 19:49

Could someone package installed llpp with bacman (community/pacman-contrib) for x86-64?

mfwitten commented on 2011-11-22 05:19

It would appear that it is not the package itself that is out of date, but rather one of the dependencies that is automatically built (lablGL). You could manually download an older version of the lablGL source into the appropriate directory until upstream gets it sorted out. That's the nature of developmental builds!

mutterschiff commented on 2011-08-22 12:34

no problems here, works like a charm - try again?

johnnyponny commented on 2011-08-06 18:32

I get this error when installing

''cvs [checkout aborted]: connect to camlcvs.inria.fr(128.93.11.35):2401 failed: Connection timed out''

kazuo commented on 2011-08-03 10:31

Hi,

We need to build the deps inside the PKGBUILD? Any reason to it?

I'm using a modified PKGBUILD with external deps (with mupdf-git as mupdf provider, we need the git version?), if one need svn/cvs/git of the deps he can build it and use a provider.

My PKGBUILD: http://codepad.org/P0tL3ZA0

mfwitten commented on 2011-07-08 18:42

1) You should have had the `db' package already; to build `llpp-git', you neend subversion, which depends on `apr-util', which depends on `db'. For some reason, your system was inconsistent.

2) If `pacman' worked, then that's all that matters :-P Please do file a report with the `packer' maintainers.

tbhartman commented on 2011-07-08 14:55

I had a few issues building...

1) First time it looked for and couldn't find 'libdb-5.2.so'. I installed extra/db and it proceeded to build correctly. Is this a dependency?
2) (btw, I use packer)...After building correctly, it prompted "Proceed with installation? [Y/n]", to which I entered nothing and hit ENTER (usually works) and it did nothing. Had to manually go to the built package and install with 'pacman -U'. This is probably a packer issue though.

Thanks!