Warning: file_exists(): open_basedir restriction in effect. File(/srv/http/vhosts/aur.archlinux.org/public/web/locale//en/LC_MESSAGES/aurweb.mo) is not within the allowed path(s): (/srv/http/vhosts/aur-dev.archlinux.org/:/etc/aurweb/) in /srv/http/vhosts/aur-dev.archlinux.org/public/web/lib/streams.php on line 90
AUR (en) - llpp-git

Notice: Undefined variable: name in /srv/http/vhosts/aur-dev.archlinux.org/public/web/lib/pkgfuncs.inc.php on line 248

Package Details: llpp-git 22.r71.g2bf99be-1

Git Clone URL: https://aur-dev.archlinux.org/llpp-git.git (read-only)
Package Base: llpp-git
Description: Fast, featureful PDF viewer based on MuPDF.
Upstream URL: http://repo.or.cz/w/llpp.git
Licenses: custom
Conflicts: llpp
Provides: llpp
Submitter: mfwitten
Maintainer: None
Last Packager: drrossum
Votes: 61
Popularity: 0.000073
First Submitted: 2010-10-26 22:21
Last Updated: 2016-01-11 17:25

Dependencies (23)

Required by (0)

Sources (1)

Latest Comments

« First ‹ Previous 1 2 3 4 5 6 7 8 9 Next › Last »

Anonymous comment on 2013-02-01 12:53

PKGBUILD still needs MAKEFLAGS='-j1'

mutterschiff commented on 2012-10-02 06:27

I get this errors on the new pkgbuild:
Fatal error: cannot find file '../src/var2def'
Fatal error: cannot find file '../src/var2switch'
Fatal error: cannot find file '../src/var2def'
Fatal error: cannot find file '../src/var2switch'

zaza commented on 2012-10-01 13:35

Oh, I found it. My problem disappears after adding MAKEFLAGS='-j1' before bash buildall.sh.

@@ -99,7 +99,7 @@
if [[ $_compile ]]; then

msg "Compiling ..."
- bash buildall.sh
+ MAKEFLAGS='-j1' bash buildall.sh

fi
}

zaza commented on 2012-09-28 12:24

I have same problems with building on 32-bit system.

bernarcher commented on 2012-09-27 21:12

I tried again from scratch, downloaded the tarball and run makepkg directly on it. Unfortunately, same result. And, yes, var2def has the executable bit set.
This is on a x86_64 system. Could this be of any influence?

mfwitten commented on 2012-09-26 13:32

According to (http://caml.inria.fr/pub/docs/manual-ocaml-4.00/manual024.html), the common error `Cannot find the bytecode file' ocurrs when `The file that ocamlrun is trying to execute (e.g. the file given as first non-option argument to ocamlrun) either does not exist, or is not a valid executable bytecode file.'

I'm guessing the var2def is for some reason not a valid executable bytecode file. On my system, `var2def' has the executable bit set; does it on your systems?

mfwitten commented on 2012-09-26 13:28

Bizarre... However, I STILL can't reproduce it; I downloaded this package's tarball and ran `makepkg -sfi' without modifying the PKGBUILD, and I got a working program.

Anonymous comment on 2012-09-26 12:56

I can.

inflating: mupdf-6e7b3ab/thirdparty/freetype-2.4.10/docs/GPLv2.TXT
inflating: mupdf-6e7b3ab/thirdparty/freetype-2.4.10/docs/raster.txt
inflating: mupdf-6e7b3ab/thirdparty/freetype-2.4.10/docs/formats.txt
inflating: mupdf-6e7b3ab/thirdparty/freetype-2.4.10/autogen.sh
inflating: mupdf-6e7b3ab/thirdparty/freetype-2.4.10/version.sed
cd src && make all LIBDIR="`ocamlc -where`"
make[1]: Entering directory `/tmp/makepkg/src/repo/3rdp/lablGL-1.04/src'
ocamlc -pp camlp4o var2def.ml -o var2def
ocamlc -pp camlp4o var2switch.ml -o var2switch
ocamlrun ../src/var2def < gl_tags.var > gl_tags.h
ocamlrun ../src/var2switch -table GL_ < gl_tags.var > gl_tags.c
Fatal error: cannot find file '../src/var2def'
make[1]: *** [gl_tags.h] Error 2
make[1]: *** Waiting for unfinished jobs....
Fatal error: cannot find file '../src/var2switch'
make[1]: *** [gl_tags.c] Error 2
make[1]: Leaving directory `/tmp/makepkg/src/repo/3rdp/lablGL-1.04/src'
make: *** [lib] Error 2
==> ERROR: A failure occurred in build().
Aborting...


/tmp/makepkg/src/repo/3rdp/lablGL-1.04/src/var2def exists.

mfwitten commented on 2012-09-25 16:09

Unfortunately, I cannot reproduce your bug.

bernarcher commented on 2012-09-25 03:33

llpp-git 20120924-1 does not build:

make[1]: Entering directory `/var/abs/local/yaourtbuild/llpp-git/src/repo/3rdp/lablGL-1.04/src'
ocamlc -pp camlp4o var2def.ml -o var2def
ocamlc -pp camlp4o var2switch.ml -o var2switch
ocamlrun ../src/var2def < gl_tags.var > gl_tags.h
Fatal error: cannot find file '../src/var2def'

The file exists properly, however:
bp:~$ ls -l var2def
-rwxr-xr-x 1 bp users 90K 25. Sep 05:15 /var/abs/local/yaourtbuild/llpp-git/src/repo/3rdp/lablGL-1.04/src/var2def