Notice: Undefined variable: name in /srv/http/vhosts/ on line 248

Package Details: libxcb-git 1.11.r58.gb15c96f-1

Git Clone URL: (read-only)
Package Base: libxcb-git
Description: X11 client-side library - git version
Upstream URL:
Licenses: custom
Conflicts: libxcb
Provides: libxcb=1.11.r58.gb15c96f
Submitter: Sanya_M
Maintainer: None
Last Packager: Sanya_M
Votes: 2
Popularity: 0.506638
First Submitted: 2015-08-11 14:10
Last Updated: 2015-08-11 14:10

Dependencies (6)

Required by (160)

Sources (2)

Latest Comments

fightcookie commented on 2017-01-02 06:07

==> Starting prepare()...
patching file
Hunk #1 FAILED at 43.
1 out of 1 hunk FAILED -- saving rejects to file
==> ERROR: A failure occurred in prepare().

ed0c commented on 2016-09-08 00:23

- remove the patch line
- add xorg-util-macros libpthread-stubs as builddeps


shoober420 commented on 2016-03-04 19:20

I get this error message when trying to build

TabError: inconsistent use of tabs and spaces in indentation
Makefile:1289: recipe for target 'xproto.c' failed
make[1]: *** [proto.c] Error 1
make[1]: Leaving directory ~/Downloads/packages/libxcb-git/src/libxcb/src
Makefile:786: recipte for target 'all-recursive' failed
make: *** [all-recursive] Error 1

ERROR: A failure occured in build().