Warning: file_exists(): open_basedir restriction in effect. File(/srv/http/vhosts/aur.archlinux.org/public/web/locale//en/LC_MESSAGES/aurweb.mo) is not within the allowed path(s): (/srv/http/vhosts/aur-dev.archlinux.org/:/etc/aurweb/) in /srv/http/vhosts/aur-dev.archlinux.org/public/web/lib/streams.php on line 90
AUR (en) - libvirt-git

Notice: Undefined variable: name in /srv/http/vhosts/aur-dev.archlinux.org/public/web/lib/pkgfuncs.inc.php on line 248

Package Details: libvirt-git pkgver=2.0.0.35.gfe8567f-1

Git Clone URL: https://aur-dev.archlinux.org/libvirt-git.git (read-only)
Package Base: libvirt-git
Description: API for controlling virtualization engines (openvz,kvm,qemu,virtualbox,xen,etc)
Upstream URL: http://libvirt.org/
Keywords: library management virtualization
Licenses: LGPL
Conflicts: libvirt
Provides: libvirt
Submitter: xtfxme
Maintainer: ArthurBorsboom
Last Packager: ArthurBorsboom
Votes: 8
Popularity: 0.000003
First Submitted: 2009-12-06 07:37
Last Updated: 2016-07-02 09:34

Dependencies (48)

Required by (39)

Sources (4)

Latest Comments

« First ‹ Previous 1 2 3 4 5 6 Next › Last »

Ba7a7chy commented on 2014-02-20 08:23

Errors in build

GEN libvirt.syms
GEN libvirt.def
GEN libvirt_qemu.def
GEN libvirt_lxc.def
GEN libvirt_probes.h
File "/bin/dtrace", line 159
print "Usage " + sys.argv[0] + " [--help] [-h | -G] [-C [-I<Path>]] -s File.d [-o <File>]"
^
SyntaxError: invalid syntax
Makefile:9730: recipe for target 'libvirt_probes.h' failed
make[2]: *** [libvirt_probes.h] Error 1
make[2]: Leaving directory '/tmp/yaourt-tmp-unshadow/aur-libvirt-git/src/libvirt/src'
Makefile:1956: recipe for target 'all-recursive' failed
make[1]: *** [all-recursive] Error 1
make[1]: Leaving directory '/tmp/yaourt-tmp-unshadow/aur-libvirt-git/src/libvirt'
Makefile:1858: recipe for target 'all' failed
make: *** [all] Error 2

gabx commented on 2014-02-19 12:34

Please correct your PKGBUILD following teekay comment.

gabx commented on 2014-02-15 23:32

Can not build :
mv: cannot stat ‘/developement/aur/libvirt-git/pkg/libvirt-git/lib/*’: No such file or directory
==> ERROR: A failure occurred in package().

teekay commented on 2014-02-13 11:34

Please use
NOCONFIGURE=1 ./autogen.sh
so configure is run only once.

Also the "mv $pkgdir/lib .." line is not needed anymore (actually, package() fails now as they moved that /lib dir to /usr/lib upstream it seems)

teekay commented on 2013-11-08 15:25

Could you please change

--libexec=/usr/lib/"$pkgname"

to

--libexec=/usr/lib/"${pkgname/-git/}"

as this breaks LXC domains which have /usr/lib/libvirt/libvirt_lxc configured as hypervisor (like, when moving from libvirt to libvirt-git and vice versa).

onny commented on 2013-08-24 16:54

@ironicbadger: I can't confirm this yet. Tried to compile libvirt-git in a clean chroot-environement but it still fails with all the docbook generation.

ironicbadger commented on 2013-08-17 20:13

docbook-xml-dtd should be added to the deps... it compiled fine once this was added.

ironicbadger commented on 2013-08-16 23:04

oh and, my /etc/xml/catalog file is empty.

ironicbadger commented on 2013-08-16 23:03

I have installed xhtml-docs and docbook-xml as per the suggestions. Won't compile for me. x64.

A much large log is here. http://pastebin.com/1Dy8NjLR

make[3]: Leaving directory `/tmp/yaourt-tmp-alex/aur-libvirt-git/src/libvirt/docs'
make[2]: *** [install-recursive] Error 1
make[2]: Leaving directory `/tmp/yaourt-tmp-alex/aur-libvirt-git/src/libvirt/docs'
make[1]: *** [install] Error 2
make[1]: Leaving directory `/tmp/yaourt-tmp-alex/aur-libvirt-git/src/libvirt/docs'
make: *** [install-recursive] Error 1
==> ERROR: A failure occurred in package().
Aborting...
==> ERROR: Makepkg was unable to build libvirt-git.
==> Restart building libvirt-git ? [y/N]

onny commented on 2013-08-10 18:39

@mjevans: libvirt-git compiles fine on my system, even without docbook-xml. Can you be please more specific?

Unfortunately, it won't compile with makechrootpkg in a 32bit environement anymore. Don't know how to fix this yet.